program: Orca
programVersion: 5.0.2
elementType: O O O C C C C C C C C C C C C C C C C C C C C C C C H H H H H H H H H H H H H H H H H H H H H H H H H H
charge: 0
multiplicity: 1
keywords: wb97x-d3
keywords: def2-TZVPP
keywords: def2/J RIJCOSX
keywords: DEFGRID2
keywords: scfconv7
keywords: smallprint printgap noloewdin
keywords: NOSOSCF
formula: C23H26O3
InChI: InChI=1/C23H26O3/c1-16(2)13-20-21(23(20,3)4)22(24)25-15-17-9-8-12-19(14-17)26-18-10-6-5-7-11-18/h5-14,20-21H,15H2,1-4H3
52 atoms
O  0.207793 -2.882648 -0.540886
O  -0.362503 -1.802227 1.333121
O  3.525827 1.855348 0.613283
C  -3.099293 -3.293036 0.930229
C  -3.201687 -1.902093 0.403838
C  -2.054512 -2.78402 -0.048142
C  -4.029638 -4.347668 0.378733
C  -2.756347 -3.503817 2.38449
C  -4.260575 -1.496281 -0.555508
C  -0.679838 -2.428806 0.35738
C  -4.086973 -0.717827 -1.624807
C  -5.234421 -0.359785 -2.520648
C  -2.764649 -0.137002 -2.024627
C  1.557743 -2.471358 -0.365162
C  1.756575 -1.0213 -0.712836
C  2.512393 -0.206664 0.117013
C  1.198444 -0.489069 -1.870455
C  2.727708 1.122608 -0.215219
C  1.404904 0.844236 -2.186283
C  2.172526 1.659217 -1.369175
C  3.160471 3.127196 0.946209
C  4.166405 4.079303 1.026867
C  1.845771 3.463562 1.246042
C  3.853486 5.374389 1.409501
C  1.54675 4.764622 1.618285
C  2.544084 5.725655 1.70094
H  -2.899564 -1.135552 1.114065
H  -2.133665 -3.187604 -1.0510
H  -3.591769 -5.340853 0.490774
H  -4.249198 -4.198569 -0.678425
H  -4.978957 -4.344021 0.918508
H  -3.674032 -3.53303 2.975042
H  -2.125499 -2.716228 2.787987
H  -2.241597 -4.455339 2.530691
H  -5.264367 -1.852506 -0.339663
H  -6.166654 -0.822363 -2.199119
H  -5.040864 -0.672937 -3.549703
H  -5.387731 0.721742 -2.548937
H  -2.446628 -0.526687 -2.995564
H  -1.971286 -0.332649 -1.307545
H  -2.843126 0.946807 -2.139037
H  2.129515 -3.106456 -1.043413
H  1.900436 -2.672894 0.652007
H  2.930271 -0.595375 1.037411
H  0.600273 -1.110356 -2.52458
H  0.971326 1.255941 -3.088126
H  2.336316 2.697222 -1.628192
H  5.185393 3.799002 0.794426
H  1.063369 2.717039 1.195834
H  4.64082 6.113941 1.472607
H  0.522931 5.024574 1.852862
H  2.302671 6.73854 1.993103
totalener: -1117.84652489 hartree
nucrepener: 2227.33996464 hartree
electener: -3345.18648953 hartree
oneelecener: -5943.47070345 hartree
twoeener: 2598.28421392 hartree
kineticenergy: 1112.85814750 hartree
xcener: -110.232294127149 hartree
chargesum: -0.0000000
charge: -0.269192 -0.379710 -0.301397 0.125973 -0.009836 -0.106500 -0.270294 -0.259388 -0.247639 0.309056 0.001022 -0.212454 -0.229310 0.070215 0.069128 -0.172423 -0.257331 0.192317 -0.078878 -0.157386 0.219829 -0.202793 -0.142166 -0.096282 -0.121804 -0.141723 0.106491 0.088054 0.091424 0.085479 0.089416 0.082141 0.102286 0.084451 0.092620 0.079001 0.083758 0.087773 0.085567 0.089118 0.090699 0.107136 0.100570 0.105968 0.124996 0.123812 0.131821 0.124032 0.138202 0.124197 0.126111 0.123841
qa: -0.2692 -0.3797 -0.3014 0.1260 -0.0098 -0.1065 -0.2703 -0.2594 -0.2476 0.3091 0.0010 -0.2125 -0.2293 0.0702 0.0691 -0.1724 -0.2573 0.1923 -0.0789 -0.1574 0.2198 -0.2028 -0.1422 -0.0963 -0.1218 -0.1417 0.1065 0.0881 0.0914 0.0855 0.0894 0.0821 0.1023 0.0845 0.0926 0.0790 0.0838 0.0878 0.0856 0.0891 0.0907 0.1071 0.1006 0.1060 0.1250 0.1238 0.1318 0.1240 0.1382 0.1242 0.1261 0.1238
va: 2.1123 2.1197 2.0982 3.7385 3.8061 3.8162 3.9079 3.9035 3.9033 4.2261 3.7483 3.9414 3.9406 3.8562 3.6530 4.0717 3.9808 3.8946 3.9087 3.9604 3.8327 4.0288 3.9228 3.9391 3.9474 3.9563 1.0250 1.0304 1.0063 1.0051 1.0021 1.0020 1.0224 1.0021 1.0103 1.0099 0.9991 0.9987 1.0000 1.0083 1.0036 0.9876 1.0119 1.0246 1.0130 1.0008 1.0032 1.0139 1.0034 0.9989 1.0002 1.0005
dispcorr: -0.025052147 hartree
energy: -1117.871577040289
dipole: -28.68113 28.16367 -0.51746 -10.26429 10.23844 -0.02585 -5.31272 4.59485 -0.71787
magnitude: 0.88531 au
magnitude: 2.25029 debye
