program: Orca
programVersion: 5.0.2
elementType: O O O C C C C C C C C C C C C C C C C C C C C C C C H H H H H H H H H H H H H H H H H H H H H H H H H H
charge: 0
multiplicity: 1
keywords: wb97x-d3
keywords: def2-TZVPP
keywords: def2/J RIJCOSX
keywords: DEFGRID2
keywords: scfconv7
keywords: smallprint printgap noloewdin
keywords: NOSOSCF
formula: C23H26O3
InChI: InChI=1/C23H26O3/c1-16(2)13-20-21(23(20,3)4)22(24)25-15-17-9-8-12-19(14-17)26-18-10-6-5-7-11-18/h5-14,20-21H,15H2,1-4H3
52 atoms
O  0.026899 -2.351824 0.171391
O  -1.142824 -0.883329 1.387143
O  2.208002 3.180836 -0.042321
C  -3.460917 -2.973455 1.070597
C  -3.611281 -1.909063 0.039921
C  -2.275125 -2.620443 0.19035
C  -4.063958 -4.334523 0.812819
C  -3.483403 -2.582413 2.528105
C  -4.416054 -2.088929 -1.193929
C  -1.113238 -1.84753 0.66999
C  -4.230321 -1.416143 -2.330767
C  -5.109572 -1.643159 -3.522879
C  -3.149343 -0.395009 -2.517306
C  1.20938 -1.601835 0.413832
C  1.256946 -0.337932 -0.402082
C  1.715144 0.836521 0.174342
C  0.865782 -0.341104 -1.73797
C  1.801596 1.997391 -0.58462
C  0.930832 0.827484 -2.478544
C  1.407142 2.000365 -1.912754
C  3.310064 3.216541 0.75963
C  3.284318 4.094888 1.833742
C  4.445339 2.457609 0.499471
C  4.40081 4.21692 2.645827
C  5.5514 2.584187 1.325412
C  5.537349 3.460958 2.400193
H  -3.598164 -0.89917 0.44191
H  -2.041307 -3.350547 -0.57572
H  -3.549474 -5.095746 1.401344
H  -4.00107 -4.631088 -0.23406
H  -5.116941 -4.351259 1.101417
H  -2.913132 -3.291215 3.131491
H  -4.5125 -2.594174 2.892129
H  -3.078214 -1.589839 2.705055
H  -5.230325 -2.806255 -1.149475
H  -5.619591 -0.722328 -3.816615
H  -5.869394 -2.400683 -3.334419
H  -4.522809 -1.962596 -4.387901
H  -3.576524 0.576132 -2.77927
H  -2.493113 -0.675079 -3.345657
H  -2.526913 -0.25654 -1.635754
H  2.022954 -2.269583 0.125929
H  1.321895 -1.376546 1.476651
H  1.988287 0.853009 1.22273
H  0.500924 -1.250025 -2.198762
H  0.618223 0.826362 -3.514527
H  1.46699 2.914703 -2.487874
H  2.393146 4.678851 2.022481
H  4.471431 1.778423 -0.342921
H  4.376094 4.904093 3.4813
H  6.434714 1.994252 1.118807
H  6.404877 3.555371 3.038972
totalener: -1117.84627305 hartree
nucrepener: 2215.38503887 hartree
electener: -3333.23131192 hartree
oneelecener: -5919.57768036 hartree
twoeener: 2586.34636844 hartree
kineticenergy: 1112.85568235 hartree
xcener: -110.231741866196 hartree
chargesum: 0.0000000
charge: -0.272754 -0.379231 -0.300223 0.138249 -0.037777 -0.076621 -0.279431 -0.255844 -0.232693 0.307263 0.008229 -0.211849 -0.238980 0.071797 0.071712 -0.142712 -0.257599 0.205532 -0.068976 -0.207099 0.232649 -0.206898 -0.150020 -0.091649 -0.121542 -0.146237 0.106551 0.080313 0.091620 0.081399 0.092907 0.083714 0.082644 0.103181 0.093677 0.086880 0.078010 0.084073 0.092111 0.078055 0.088324 0.105500 0.099636 0.114231 0.121797 0.122786 0.125284 0.126046 0.129284 0.124766 0.125578 0.124338
qa: -0.2728 -0.3792 -0.3002 0.1382 -0.0378 -0.0766 -0.2794 -0.2558 -0.2327 0.3073 0.0082 -0.2118 -0.2390 0.0718 0.0717 -0.1427 -0.2576 0.2055 -0.0690 -0.2071 0.2326 -0.2069 -0.1500 -0.0916 -0.1215 -0.1462 0.1066 0.0803 0.0916 0.0814 0.0929 0.0837 0.0826 0.1032 0.0937 0.0869 0.0780 0.0841 0.0921 0.0781 0.0883 0.1055 0.0996 0.1142 0.1218 0.1228 0.1253 0.1260 0.1293 0.1248 0.1256 0.1243
va: 2.1137 2.1187 2.1044 3.7493 3.8427 3.7970 3.9132 3.8932 3.8989 4.2247 3.7268 3.9404 3.9536 3.8674 3.6422 3.9677 3.9872 3.8550 3.8989 4.0551 3.8277 4.0317 3.9258 3.9362 3.9538 3.9609 1.0238 1.0342 1.0065 1.0045 1.0002 1.0025 1.0017 1.0227 1.0093 0.9985 1.0101 0.9987 1.0022 1.0007 1.0109 0.9873 1.0128 1.0154 1.0160 0.9994 1.0117 1.0140 1.0060 0.9988 1.0002 1.0006
dispcorr: -0.024731761 hartree
energy: -1117.871004810322
dipole: -25.00380 25.13097 0.12717 -16.41862 15.78180 -0.63682 -5.46364 5.04206 -0.42158
magnitude: 0.77423 au
magnitude: 1.96794 debye
