program: Orca
programVersion: 5.0.2
elementType: O O O C C C C C C C C C C C C C C C C C C C C C C C H H H H H H H H H H H H H H H H H H H H H H H H H H
charge: 0
multiplicity: 1
keywords: wb97x-d3
keywords: def2-TZVPP
keywords: def2/J RIJCOSX
keywords: DEFGRID2
keywords: scfconv7
keywords: smallprint printgap noloewdin
keywords: NOSOSCF
formula: C23H26O3
InChI: InChI=1/C23H26O3/c1-16(2)13-20-21(23(20,3)4)22(24)25-15-17-9-8-12-19(14-17)26-18-10-6-5-7-11-18/h5-14,20-21H,15H2,1-4H3
52 atoms
O  0.242299 -1.744056 -1.334735
O  -0.064215 -3.413843 0.124064
O  2.876185 2.391173 0.891525
C  -3.091122 -3.077639 -0.584243
C  -2.775466 -2.284285 0.638694
C  -1.927541 -2.103198 -0.605974
C  -4.28154 -2.667554 -1.419369
C  -2.855423 -4.568111 -0.578571
C  -3.657206 -1.192022 1.12293
C  -0.511753 -2.522283 -0.549896
C  -3.267126 0.02755 1.496887
C  -4.257093 1.04176 1.98624
C  -1.845175 0.500398 1.465707
C  1.66108 -1.875484 -1.221769
C  2.168535 -1.092549 -0.043532
C  2.279527 0.29085 -0.151658
C  2.486065 -1.720246 1.153128
C  2.704835 1.040548 0.935662
C  2.916506 -0.9617 2.232936
C  3.022251 0.414041 2.13526
C  2.22398 3.122045 -0.061528
C  2.980356 3.877773 -0.942606
C  0.836458 3.144292 -0.120189
C  2.340482 4.663872 -1.890489
C  0.208946 3.923929 -1.077807
C  0.956443 4.685351 -1.966189
H  -2.276093 -2.853627 1.419665
H  -2.100694 -1.194366 -1.170715
H  -4.439354 -1.588946 -1.418589
H  -5.193683 -3.135337 -1.042707
H  -4.152298 -2.98586 -2.455131
H  -2.024642 -4.862282 0.056908
H  -2.653713 -4.93451 -1.586933
H  -3.751276 -5.077507 -0.218106
H  -4.713495 -1.435922 1.202206
H  -4.219711 1.951188 1.381017
H  -4.033844 1.343672 3.01248
H  -5.278731 0.664875 1.962467
H  -1.72525 1.299763 0.728599
H  -1.128711 -0.281541 1.228358
H  -1.56159 0.924239 2.432052
H  2.053702 -1.469289 -2.153803
H  1.95291 -2.924347 -1.156089
H  2.036583 0.773469 -1.090592
H  2.384965 -2.792844 1.243745
H  3.165103 -1.447672 3.16707
H  3.355413 1.008889 2.975623
H  4.06021 3.849727 -0.879084
H  0.255753 2.55517 0.578133
H  2.930741 5.256155 -2.577127
H  -0.872007 3.939567 -1.125916
H  0.461537 5.294343 -2.710549
totalener: -1117.84620001 hartree
nucrepener: 2288.72376000 hartree
electener: -3406.56996001 hartree
oneelecener: -6066.10216876 hartree
twoeener: 2659.53220875 hartree
kineticenergy: 1112.85919568 hartree
xcener: -110.232180476534 hartree
chargesum: -0.0000000
charge: -0.260432 -0.398774 -0.298974 0.126964 -0.013497 -0.123659 -0.268033 -0.260710 -0.237752 0.338620 -0.007914 -0.214297 -0.226437 0.046448 -0.030232 -0.188311 -0.129877 0.242681 -0.094579 -0.207363 0.185479 -0.163007 -0.121871 -0.119546 -0.142325 -0.114563 0.105208 0.091184 0.085069 0.088339 0.092198 0.102911 0.083788 0.081128 0.093283 0.081714 0.088727 0.079487 0.078500 0.094278 0.098006 0.106109 0.107341 0.114498 0.122259 0.124896 0.124908 0.125961 0.137422 0.125855 0.122433 0.126458
qa: -0.2604 -0.3988 -0.2990 0.1270 -0.0135 -0.1237 -0.2680 -0.2607 -0.2378 0.3386 -0.0079 -0.2143 -0.2264 0.0464 -0.0302 -0.1883 -0.1299 0.2427 -0.0946 -0.2074 0.1855 -0.1630 -0.1219 -0.1195 -0.1423 -0.1146 0.1052 0.0912 0.0851 0.0883 0.0922 0.1029 0.0838 0.0811 0.0933 0.0817 0.0887 0.0795 0.0785 0.0943 0.0980 0.1061 0.1073 0.1145 0.1223 0.1249 0.1249 0.1260 0.1374 0.1259 0.1224 0.1265
va: 2.1214 2.0946 2.1103 3.7251 3.8072 3.8418 3.9064 3.9025 3.8966 4.2052 3.7657 3.9396 3.9380 3.8630 3.7262 3.9310 3.9579 3.8205 3.9615 4.0247 3.9067 4.0056 3.9432 3.9436 3.9742 3.9435 1.0266 1.0283 1.0056 1.0026 1.0061 1.0230 1.0023 1.0017 1.0098 0.9991 0.9988 1.0100 1.0024 1.0064 1.0001 0.9957 1.0127 1.0186 1.0226 0.9991 1.0132 1.0116 0.9971 0.9996 1.0031 0.9999
dispcorr: -0.026289851 hartree
energy: -1117.872489858335
dipole: -25.79114 25.37436 -0.41677 -6.23818 6.83805 0.59987 0.27993 -0.73366 -0.45374
magnitude: 0.85990 au
magnitude: 2.18569 debye
