program: Orca
programVersion: 5.0.2
elementType: O O O C C C C C C C C C C C C C C C C C C C C C C C H H H H H H H H H H H H H H H H H H H H H H H H H H
charge: 0
multiplicity: 1
keywords: wb97x-d3
keywords: def2-TZVPP
keywords: def2/J RIJCOSX
keywords: DEFGRID2
keywords: scfconv7
keywords: smallprint printgap noloewdin
keywords: NOSOSCF
formula: C23H26O3
InChI: InChI=1/C23H26O3/c1-16(2)13-20-21(23(20,3)4)22(24)25-15-17-9-8-12-19(14-17)26-18-10-6-5-7-11-18/h5-14,20-21H,15H2,1-4H3
52 atoms
O  -0.043492 -1.681171 -1.436336
O  -0.08363 -3.413763 -0.020029
O  1.885747 2.641681 0.962869
C  -3.16866 -3.389953 -0.607371
C  -2.882264 -2.648071 0.653606
C  -2.116088 -2.296617 -0.607878
C  -4.429208 -3.057763 -1.3710
C  -2.773606 -4.842234 -0.712286
C  -3.842502 -1.67943 1.240719
C  -0.664164 -2.559745 -0.63896
C  -3.530705 -0.486237 1.749659
C  -4.584603 0.403633 2.337013
C  -2.138514 0.0670 1.790444
C  1.382061 -1.637895 -1.372723
C  1.823491 -0.843267 -0.175323
C  1.685054 0.540088 -0.191107
C  2.308656 -1.472205 0.965122
C  2.042443 1.286561 0.92249
C  2.654365 -0.71841 2.076507
C  2.529199 0.661098 2.061304
C  2.277137 3.400012 -0.100944
C  3.426675 3.120224 -0.830845
C  1.505739 4.512797 -0.405585
C  3.792211 3.960121 -1.870966
C  1.889221 5.349001 -1.442406
C  3.028678 5.075214 -2.184058
H  -2.28861 -3.207129 1.373723
H  -2.41163 -1.376616 -1.098526
H  -5.271491 -3.64483 -0.998521
H  -4.308793 -3.290785 -2.430404
H  -4.699022 -2.004641 -1.290085
H  -3.585019 -5.470471 -0.339283
H  -1.8792 -5.078647 -0.141631
H  -2.593526 -5.122732 -1.752047
H  -4.88128 -1.996751 1.277121
H  -4.607233 1.37218 1.831055
H  -4.380698 0.60921 3.390793
H  -5.579198 -0.035185 2.26734
H  -2.055686 0.962885 1.169729
H  -1.379591 -0.637511 1.460189
H  -1.879748 0.373659 2.80656
H  1.689716 -1.150435 -2.297806
H  1.806766 -2.642577 -1.358755
H  1.29542 1.03544 -1.073063
H  2.397078 -2.549655 0.988025
H  3.029493 -1.209098 2.964679
H  2.801476 1.256364 2.922862
H  4.035494 2.25888 -0.587925
H  0.615248 4.718582 0.173649
H  4.688213 3.7410 -2.43671
H  1.285333 6.215976 -1.675799
H  3.321589 5.726758 -2.995931
totalener: -1117.84667293 hartree
nucrepener: 2250.93286489 hartree
electener: -3368.77953782 hartree
oneelecener: -5990.65712832 hartree
twoeener: 2621.87759050 hartree
kineticenergy: 1112.86163263 hartree
xcener: -110.232165943704 hartree
chargesum: -0.0000000
charge: -0.262086 -0.397302 -0.304429 0.131107 -0.016763 -0.113853 -0.270598 -0.260230 -0.246511 0.333377 0.001409 -0.212490 -0.214153 0.052843 -0.015120 -0.186130 -0.114153 0.212239 -0.103679 -0.193790 0.237673 -0.151129 -0.208603 -0.122031 -0.092401 -0.145441 0.105787 0.089823 0.089160 0.091108 0.086021 0.082020 0.101917 0.083257 0.092661 0.083941 0.087445 0.077963 0.088209 0.078120 0.089373 0.109346 0.104962 0.118424 0.120868 0.125560 0.126920 0.130140 0.123906 0.126058 0.124426 0.124827
qa: -0.2621 -0.3973 -0.3044 0.1311 -0.0168 -0.1139 -0.2706 -0.2602 -0.2465 0.3334 0.0014 -0.2125 -0.2142 0.0528 -0.0151 -0.1861 -0.1142 0.2122 -0.1037 -0.1938 0.2377 -0.1511 -0.2086 -0.1220 -0.0924 -0.1454 0.1058 0.0898 0.0892 0.0911 0.0860 0.0820 0.1019 0.0833 0.0927 0.0839 0.0874 0.0780 0.0882 0.0781 0.0894 0.1093 0.1050 0.1184 0.1209 0.1256 0.1269 0.1301 0.1239 0.1261 0.1244 0.1248
va: 2.1189 2.0971 2.0937 3.7223 3.8154 3.8243 3.9080 3.9013 3.8949 4.2107 3.7507 3.9403 3.9437 3.8648 3.6801 3.9411 3.9466 3.8211 3.9552 4.0287 3.8222 3.9221 4.0297 3.9537 3.9389 3.9603 1.0263 1.0300 1.0021 1.0063 1.0051 1.0019 1.0224 1.0022 1.0107 0.9994 0.9989 1.0098 1.0015 1.0128 1.0034 0.9937 1.0134 1.0161 1.0217 0.9995 1.0114 1.0055 1.0142 1.0001 0.9988 1.0004
dispcorr: -0.025280547 hartree
energy: -1117.871953476242
dipole: -23.66959 23.56765 -0.10194 -9.27114 9.74206 0.47092 1.33200 -1.70767 -0.37567
magnitude: 0.61097 au
magnitude: 1.55295 debye
