program: Orca
programVersion: 5.0.2
elementType: O O O C C C C C C C C C C C C C C C C C C C C C C C H H H H H H H H H H H H H H H H H H H H H H H H H H
charge: 0
multiplicity: 1
keywords: wb97x-d3
keywords: def2-TZVPP
keywords: def2/J RIJCOSX
keywords: DEFGRID2
keywords: scfconv7
keywords: smallprint printgap noloewdin
keywords: NOSOSCF
formula: C23H26O3
InChI: InChI=1/C23H26O3/c1-16(2)13-20-21(23(20,3)4)22(24)25-15-17-9-8-12-19(14-17)26-18-10-6-5-7-11-18/h5-14,20-21H,15H2,1-4H3
52 atoms
O  0.741773 -2.629505 -0.406618
O  -0.135082 -1.713825 1.443122
O  3.093513 2.06346 0.432832
C  -2.846186 -2.320233 0.020791
C  -2.478149 -0.879799 -0.17173
C  -1.474783 -1.96021 -0.518939
C  -3.791474 -2.967265 -0.963716
C  -3.015525 -2.8403 1.427257
C  -3.065717 -0.049117 -1.243196
C  -0.247351 -2.073353 0.299406
C  -3.790512 1.060159 -1.074635
C  -4.338832 1.812053 -2.250625
C  -4.138292 1.648275 0.2596
C  2.041254 -2.720609 0.188256
C  2.879363 -1.537999 -0.208027
C  2.624601 -0.294011 0.358702
C  3.874689 -1.662738 -1.169177
C  3.327016 0.821019 -0.074207
C  4.606925 -0.55066 -1.559056
C  4.329135 0.697229 -1.027491
C  1.814068 2.434978 0.737327
C  0.73375 2.110041 -0.074846
C  1.628501 3.198218 1.880232
C  -0.535559 2.539916 0.276259
C  0.354938 3.634676 2.212432
C  -0.732791 3.301447 1.419299
H  -2.240443 -0.358701 0.750093
H  -1.328264 -2.165067 -1.573972
H  -4.826099 -2.732419 -0.708023
H  -3.680507 -4.052625 -0.942885
H  -3.627284 -2.639712 -1.989419
H  -2.383338 -2.329537 2.148229
H  -2.789858 -3.90737 1.478166
H  -4.053554 -2.709895 1.738951
H  -2.894153 -0.384348 -2.262147
H  -5.428356 1.880484 -2.198817
H  -4.077888 1.34207 -3.197961
H  -3.96436 2.838791 -2.271501
H  -3.854055 2.703154 0.305767
H  -3.667083 1.13952 1.097577
H  -5.21916 1.615236 0.419869
H  2.473606 -3.643065 -0.199052
H  1.961714 -2.807653 1.272352
H  1.867967 -0.196256 1.126411
H  4.078185 -2.627813 -1.616206
H  5.387265 -0.651493 -2.301569
H  4.877876 1.573974 -1.345087
H  0.873851 1.520033 -0.971214
H  2.479928 3.443778 2.501243
H  -1.372715 2.270028 -0.354619
H  0.214629 4.229066 3.105653
H  -1.726889 3.632465 1.688998
totalener: -1117.84760972 hartree
nucrepener: 2323.42608371 hartree
electener: -3441.27369344 hartree
oneelecener: -6135.57809855 hartree
twoeener: 2694.30440511 hartree
kineticenergy: 1112.84964610 hartree
xcener: -110.233346014351 hartree
chargesum: 0.0000000
charge: -0.262668 -0.405895 -0.302280 0.110680 0.014213 -0.094801 -0.237979 -0.267499 -0.183523 0.351604 -0.064555 -0.202272 -0.268949 0.056968 0.006406 -0.195563 -0.198156 0.248681 -0.074486 -0.224405 0.277768 -0.214007 -0.221631 -0.055490 -0.075408 -0.184306 0.094785 0.073318 0.090285 0.092042 0.071709 0.104313 0.084607 0.083328 0.079887 0.087350 0.078284 0.085517 0.079391 0.097206 0.103580 0.092388 0.117707 0.162492 0.106563 0.124104 0.124882 0.125781 0.122458 0.147084 0.122593 0.115900
qa: -0.2627 -0.4059 -0.3023 0.1107 0.0142 -0.0948 -0.2380 -0.2675 -0.1835 0.3516 -0.0646 -0.2023 -0.2689 0.0570 0.0064 -0.1956 -0.1982 0.2487 -0.0745 -0.2244 0.2778 -0.2140 -0.2216 -0.0555 -0.0754 -0.1843 0.0948 0.0733 0.0903 0.0920 0.0717 0.1043 0.0846 0.0833 0.0799 0.0873 0.0783 0.0855 0.0794 0.0972 0.1036 0.0924 0.1177 0.1625 0.1066 0.1241 0.1249 0.1258 0.1225 0.1471 0.1226 0.1159
va: 2.1378 2.0812 2.1161 3.7658 3.7496 3.9283 3.9126 3.9120 3.8287 4.1918 3.8028 3.9302 3.9483 3.8582 3.7392 3.8793 4.0348 3.8375 3.9340 4.0611 3.7842 3.9940 4.0593 3.8554 3.9544 4.0012 1.0290 1.0396 1.0053 1.0049 1.0098 1.0219 1.0029 1.0012 1.0195 0.9981 1.0124 0.9982 0.9951 1.0091 1.0029 1.0000 1.0144 1.0128 1.0126 0.9990 1.0130 1.0097 1.0144 0.9785 0.9994 1.0049
dispcorr: -0.027254882 hartree
energy: -1117.874864606595
dipole: -30.76643 30.20603 -0.56041 -2.95803 2.65178 -0.30624 -4.29666 3.73171 -0.56495
magnitude: 0.85265 au
magnitude: 2.16727 debye
