program: Gaussian 09
title: 000071902
version: EM64L-G09RevD.01
frameworkgroup: C1[X(C22H30O3)]
method: RPBEPBE
basis: SDD
operation: Freq
keyword: #pfreq=noraman
keyword: PBEPBE/SDD
title: #p freq=noraman PBEPBE/SDD
converged: YES YES NO NO
title: Mulliken charges:
elementType: O O O C C C C C C C C C C C C C C C C C C C C C C H H H H H H H H H H H H H H H H H H H H H H H H H H H H H H
charge: -0.313878 -0.296552 -0.438855 0.313372 -0.311039 -0.160878 0.342219 0.363676 -0.484862 -0.519955 -0.251441 -0.423302 -0.517953 -0.456222 -0.471807 -0.768568 0.132744 -0.768582 -0.783444 0.235911 0.154624 -0.627361 -0.572594 0.529807 -0.815203 0.245910 0.187349 0.245632 0.249809 0.221268 0.238571 0.268626 0.208520 0.224763 0.228669 0.198301 0.201589 0.198390 0.210313 0.200846 0.236842 0.212215 0.244907 0.208892 0.213200 0.233560 0.212479 0.212920 0.225287 0.255535 0.251960 0.390479 0.233580 0.223903 0.225832
chargesum: 0.00000
title: Mulliken charges with hydrogens summed into heavy atoms:
elementType: O O O C C C C C C C C C C C C C C C C C C C C C C
charge: -0.313878 -0.296552 -0.048375 0.313372 -0.065129 0.026471 0.342219 0.363676 0.010579 -0.060116 0.017184 0.009981 -0.090984 -0.056243 -0.060649 -0.074603 0.132744 -0.112930 -0.132759 0.235911 0.154624 -0.371827 -0.320634 0.529807 -0.131887
polarizability: 2.85805828e+02 1.02808102e+01 2.19585570e+02 -2.00641538e+01 7.53424490e+00 2.04921485e+02
1716.lowfreq: -48.1122 -21.4981 -15.4096 -4.9634 0.0002 0.0002 0.0006 41.5003 69.3692
frequency: -48.0647 41.4509 69.3383 78.9701 113.1741 143.4249 151.6271 175.1679 189.0301 196.3343 199.1195 214.1838 229.2137 236.3536 241.5275 247.5766 251.4982 270.4782 283.6390 292.0966 309.2957 317.5494 333.2091 361.6252 373.3644 380.5902 391.5832 426.2090 443.5792 461.7776 476.5253 484.8129 494.5541 513.0742 527.0365 531.6743 563.3670 573.8543 589.3073 596.0286 638.1170 648.6242 694.6058 699.7086 712.2770 727.8068 746.3774 782.3777 823.2065 836.9830 844.3531 847.8913 855.6570 867.3418 868.9884 875.0807 890.8405 899.5262 906.2055 932.3832 940.7591 957.5201 965.3849 966.1956 977.0288 983.9828 995.7361 1001.9481 1010.5320 1032.5479 1044.5104 1051.5165 1057.6331 1062.9808 1077.8942 1084.5157 1087.6370 1123.9387 1137.0824 1150.8519 1165.2632 1170.2942 1172.0142 1180.2825 1191.5234 1205.8525 1210.5581 1219.1218 1234.1981 1251.0978 1261.5198 1277.0215 1278.9934 1286.7977 1293.0229 1304.1252 1310.9642 1312.3288 1327.9870 1332.0835 1335.7073 1337.8501 1347.2446 1355.0680 1357.3258 1361.2790 1377.1362 1384.8174 1387.3099 1395.1926 1397.4286 1444.2626 1445.7049 1457.4152 1462.7218 1467.2746 1468.5419 1471.5007 1472.8651 1474.1638 1474.7792 1477.0298 1479.0605 1487.4392 1489.2085 1495.7962 1503.9454 1577.7748 1637.6016 2919.3838 2963.4341 2967.8160 2968.2227 2974.3776 2976.1191 2977.2807 2979.1609 2980.1078 2985.0460 2997.7822 3008.8135 3014.9052 3022.4357 3033.5079 3040.7567 3054.3920 3057.9509 3060.6572 3065.1618 3075.3482 3081.7058 3084.3632 3087.1797 3089.8974 3092.9055 3102.9744 3151.5536 3158.2853 3312.5398
redmass: 1.0098 4.2295 4.3434 3.7668 3.4700 2.6777 2.0876 2.3202 2.9511 3.1268 2.1339 2.4685 3.4487 1.1339 1.8884 2.5064 2.6348 3.0188 3.0303 2.4192 2.2876 2.7296 2.5428 4.3803 2.6229 3.5989 2.2545 2.9030 2.8974 3.1670 3.2064 3.5081 3.6088 3.4693 4.0712 2.9327 4.0190 3.9674 3.6227 4.1431 3.2913 5.0078 3.3283 1.1495 2.6441 3.5735 3.1021 3.6071 3.1551 2.3043 3.1536 1.6528 1.8389 2.5986 1.4984 2.9247 2.4362 2.4600 2.9092 1.5011 2.0610 2.1346 1.9182 1.9285 3.0640 1.9295 1.6962 1.9507 1.7757 2.8161 1.5515 1.9258 1.7822 1.8143 2.4311 2.2778 2.1084 2.0713 1.5775 1.7330 1.8266 1.8044 2.2601 1.5732 1.8388 1.6492 1.7342 1.8665 2.0045 1.7824 1.2874 1.4679 1.7354 1.5874 1.7448 1.3764 1.4760 1.7236 2.0563 1.4968 1.5020 1.5617 1.5368 1.5254 1.5210 1.5585 1.2068 4.6987 1.2496 1.2309 1.2042 1.1891 2.0999 1.0621 1.0855 1.0675 1.0726 1.0888 1.0708 1.1923 1.0921 1.0536 1.0621 2.0619 1.2958 1.0738 1.0628 6.7854 6.6643 1.0830 1.0561 1.0640 1.0560 1.0617 1.0387 1.0494 1.0577 1.0594 1.0411 1.0848 1.0642 1.0876 1.0785 1.0900 1.0971 1.0992 1.0949 1.0984 1.1014 1.0981 1.0992 1.0999 1.0999 1.1001 1.0992 1.0936 1.0914 1.0924 1.0670
irintensity: 0.2439 0.3606 0.5910 0.7378 1.9948 0.2044 1.8160 0.8590 1.8570 0.1365 2.3058 1.7077 0.1906 0.5826 0.2279 1.3263 1.2874 0.3705 2.6042 2.2495 1.9718 0.4975 0.3394 3.7489 1.2792 4.2370 0.4717 0.6268 1.8115 6.0733 1.6887 1.2746 7.0064 2.3127 4.6350 2.6263 5.8269 7.4797 3.0066 0.9289 2.4633 2.5835 1.7933 109.0433 6.6693 2.1846 4.2910 13.9203 2.3575 20.5537 25.4809 30.6971 12.9009 3.6162 4.0092 11.1003 14.3512 41.5046 33.1808 1.3482 1.6130 13.0661 2.8257 3.5391 24.6890 15.6092 11.7687 15.7788 10.4607 108.0029 17.8042 15.6960 2.2107 6.2165 5.1723 4.1072 1.9736 43.7784 2.3155 7.8665 4.5324 2.2483 35.2970 63.9692 6.7815 25.5645 23.6621 4.3380 5.8623 4.5434 7.1880 10.8712 16.0862 10.7632 32.0312 21.2176 2.0705 5.8190 41.5258 6.8332 1.3972 36.3302 27.6249 18.6392 17.9719 7.9892 17.4727 20.3124 19.0194 10.3568 22.4903 7.7132 1.0155 2.8311 21.7493 1.2405 1.0987 7.9883 13.0638 29.3672 33.5597 4.2181 6.8342 7.7178 11.0850 11.3159 11.8459 136.2044 157.9840 31.5030 17.4148 11.0505 45.2614 23.7031 47.4384 1.6278 34.4503 95.6153 31.0363 56.6828 38.6710 30.3853 15.9409 43.1770 17.8247 0.6387 23.4081 65.6080 53.9309 36.3061 30.5223 14.0032 19.2357 20.6145 27.3311 39.1138 5.2057 5.4621 251.5832
temp: 298.150 k
press: 1.00000 atm
elementType: 8 8 8 6 6 6 6 6 6 6 6 6 6 6 6 6 6 6 6 6 6 6 6 6 6 1 1 1 1 1 1 1 1 1 1 1 1 1 1 1 1 1 1 1 1 1 1 1 1 1 1 1 1 1 1
symmnumber: 1
zpe: 1242168.3 jmol-1
zpe.correction: 0.473117 hartree
zpe.thermalcorrener: 0.495136 hartree
zpe.thermalcorrenthalpy: 0.496080 hartree
zpe.thermalcorrgfe: 0.425739 hartree
zpe.sumelectzpe: -1080.113054 hartree
zpe.sumelectthermal: -1080.091035 hartree
zpe.sumelectthermalent: -1080.090091 hartree
zpe.sumelectthermalfe: -1080.160432 hartree
dipole: 3.9290 2.1078 0.2331
dipole: 4.4648
quadrupole: -151.0002 -153.1503 -148.5628
quadrupole: -5.0567 -8.0421 -6.5737
quadrupole: -0.0957 -2.2459 2.3416 -5.0567 -8.0421 -6.5737
hfenergy: -1080.5861705 hartree
pointgroup: C01 [X(C22H30O3)]
dipole: 1.5502507 -0.8257076 -0.0220418 debye
polarizability: 285.1714026|-9.0283873|220.2466506|21.9133592|6.672624|204.8948302 unknown
InChI: InChI=1S/C22H30O3/c1-13-10-14(23)17-15(11-13)25-21(4)9-6-16-20(2,3)7-5-8-22(16)12-24-18(17)19(21)22/h10-11,16,18-19,23H,5-9,12H2,1-4H3
charge 0 multiplicity 1
55 atoms
O  -0.228226 1.759301 1.703568
O  -0.855207 -1.827775 -0.367241
O  -2.867248 2.348745 1.290203
C  1.311894 0.388246 0.419944
C  0.395992 -0.511923 1.338953
C  2.679015 -0.369338 0.289621
C  0.035748 -1.914593 0.839943
C  3.77999 0.405447 -0.531962
C  0.787424 0.743036 -1.010313
C  2.378237 -1.778354 -0.330441
C  -0.808847 0.364789 1.656278
C  1.212991 1.68213 1.28062
C  1.332558 -2.637713 0.422707
C  3.198994 0.838507 -1.912789
C  1.836119 1.558535 -1.808174
C  -0.732289 -2.735145 1.900765
C  -1.880647 0.225111 0.596698
C  4.277741 1.646276 0.26276
C  5.027004 -0.491756 -0.768933
C  -1.897672 -0.870923 -0.305846
C  -2.906674 1.200104 0.487115
C  -2.949539 -1.029773 -1.233069
C  -3.9683 1.046774 -0.428148
C  -3.996302 -0.076136 -1.292192
C  -5.116818 -0.231265 -2.307296
H  0.977695 -0.659346 2.273028
H  3.087184 -0.529678 1.314692
H  -0.142364 1.332467 -0.931156
H  0.527889 -0.17219 -1.567609
H  3.314771 -2.363081 -0.362972
H  2.051984 -1.656727 -1.378699
H  -1.227726 0.193591 2.666049
H  1.848956 1.638334 2.187818
H  1.406032 2.617417 0.734165
H  1.061782 -3.5187 -0.189803
H  1.789427 -3.026433 1.35515
H  3.081569 -0.058865 -2.553475
H  3.935049 1.490496 -2.424994
H  1.440194 1.747833 -2.824671
H  1.973474 2.557892 -1.34884
H  -0.891339 -3.763238 1.531171
H  -0.167694 -2.787532 2.849672
H  -1.721613 -2.291185 2.108168
H  4.690398 1.343126 1.244204
H  5.085641 2.154949 -0.296579
H  3.489653 2.394019 0.445483
H  5.843327 0.107422 -1.214604
H  5.403735 -0.917736 0.181342
H  4.819281 -1.326279 -1.461218
H  -2.936726 -1.895194 -1.902986
H  -4.745458 1.816153 -0.470639
H  -1.923329 2.495965 1.599632
H  -4.861795 0.273234 -3.259595
H  -5.308331 -1.293662 -2.538826
H  -6.057002 0.215943 -1.940082
