program: Orca
programVersion: 5.0.2
elementType: O O O C C C C C C C C C C C C C C C C C C C C C C C H H H H H H H H H H H H H H H H H H H H H H H H H H
charge: 0
multiplicity: 1
keywords: wb97x-d3
keywords: def2-TZVPP
keywords: def2/J RIJCOSX
keywords: DEFGRID2
keywords: scfconv7
keywords: smallprint printgap noloewdin
keywords: NOSOSCF
formula: C23H26O3
InChI: InChI=1/C23H26O3/c1-16(2)13-20-21(23(20,3)4)22(24)25-15-17-9-8-12-19(14-17)26-18-10-6-5-7-11-18/h5-14,20-21H,15H2,1-4H3
52 atoms
O  -0.032201 -2.423124 -1.148813
O  -1.17779 -0.511146 -1.332225
O  3.694125 2.209031 -0.868334
C  -2.955952 -1.934791 0.858703
C  -3.637093 -1.944992 -0.47521
C  -2.219148 -2.441638 -0.372143
C  -3.330303 -2.989421 1.871215
C  -2.588578 -0.610289 1.480993
C  -4.726493 -2.898102 -0.811703
C  -1.126501 -1.6627 -0.99435
C  -5.996728 -2.765807 -0.427756
C  -7.044247 -3.758936 -0.830408
C  -6.481233 -1.629274 0.41999
C  1.109879 -1.790597 -1.708496
C  1.818743 -0.888066 -0.736322
C  2.383831 0.293361 -1.192334
C  1.961628 -1.24434 0.600392
C  3.111388 1.101295 -0.329982
C  2.672466 -0.421304 1.458627
C  3.259133 0.750054 1.005419
C  3.813309 3.344862 -0.120266
C  5.033053 4.004288 -0.142171
C  2.743261 3.863554 0.59937
C  5.182306 5.189995 0.561573
C  2.909106 5.044178 1.305558
C  4.125825 5.7118 1.292215
H  -3.717525 -0.965704 -0.940976
H  -2.07576 -3.516792 -0.401475
H  -2.510843 -3.155278 2.572882
H  -3.577176 -3.943834 1.408264
H  -4.202189 -2.674827 2.448346
H  -1.713541 -0.709472 2.126303
H  -3.414626 -0.256582 2.101674
H  -2.372908 0.158893 0.743553
H  -4.460207 -3.748484 -1.433128
H  -6.636719 -4.556951 -1.449815
H  -7.848797 -3.277119 -1.391255
H  -7.508359 -4.216832 0.046792
H  -5.683916 -0.947457 0.709608
H  -6.955432 -1.999708 1.332308
H  -7.241701 -1.04932 -0.10909
H  0.845345 -1.240611 -2.614603
H  1.765738 -2.613641 -1.997517
H  2.260712 0.600501 -2.22382
H  1.521426 -2.159871 0.972999
H  2.784264 -0.698818 2.498534
H  3.824625 1.375668 1.683416
H  5.853854 3.588575 -0.711688
H  1.789338 3.351774 0.604783
H  6.13432 5.703821 0.542031
H  2.075546 5.447851 1.865113
H  4.24688 6.634318 1.843572
totalener: -1117.84682166 hartree
nucrepener: 2168.15220236 hartree
electener: -3285.99902403 hartree
oneelecener: -5825.12467831 hartree
twoeener: 2539.12565429 hartree
kineticenergy: 1112.85328575 hartree
xcener: -110.230934104740 hartree
chargesum: 0.0000000
charge: -0.277844 -0.375562 -0.299959 0.068953 -0.028740 -0.088215 -0.247108 -0.258657 -0.189582 0.330936 -0.023614 -0.210851 -0.242816 0.070629 0.078471 -0.204514 -0.226405 0.210502 -0.095173 -0.164371 0.223481 -0.200218 -0.151659 -0.097622 -0.118287 -0.139820 0.108748 0.080940 0.095028 0.083667 0.084869 0.086176 0.081365 0.104237 0.089048 0.079722 0.086139 0.083720 0.083243 0.086591 0.098287 0.101780 0.106055 0.105243 0.118313 0.124841 0.130261 0.124954 0.138457 0.124476 0.127052 0.124831
qa: -0.2778 -0.3756 -0.3000 0.0690 -0.0287 -0.0882 -0.2471 -0.2587 -0.1896 0.3309 -0.0236 -0.2109 -0.2428 0.0706 0.0785 -0.2045 -0.2264 0.2105 -0.0952 -0.1644 0.2235 -0.2002 -0.1517 -0.0976 -0.1183 -0.1398 0.1087 0.0809 0.0950 0.0837 0.0849 0.0862 0.0814 0.1042 0.0890 0.0797 0.0861 0.0837 0.0832 0.0866 0.0983 0.1018 0.1061 0.1052 0.1183 0.1248 0.1303 0.1250 0.1385 0.1245 0.1271 0.1248
va: 2.1195 2.1287 2.1026 3.7391 3.8240 3.8318 3.9059 3.9022 3.8562 4.2575 3.7399 3.9388 3.9361 3.8571 3.6646 4.0886 4.0008 3.8851 3.9362 3.9464 3.8311 4.0334 3.9443 3.9356 3.9415 3.9547 1.0272 1.0345 1.0061 1.0069 1.0023 1.0052 1.0028 1.0214 1.0131 1.0105 0.9983 0.9988 1.0111 0.9992 1.0033 1.0127 0.9865 1.0257 1.0205 1.0003 1.0046 1.0134 1.0020 0.9991 1.0000 1.0004
dispcorr: -0.024086109 hartree
energy: -1117.870907771743
dipole: -34.70298 34.40142 -0.30156 -14.05274 13.61855 -0.43419 9.78813 -9.11504 0.67309
magnitude: 0.85587 au
magnitude: 2.17544 debye
