program: Orca
programVersion: 5.0.2
elementType: O O O C C C C C C C C C C C C C C C C C C C C C C C H H H H H H H H H H H H H H H H H H H H H H H H H H
charge: 0
multiplicity: 1
keywords: wb97x-d3
keywords: def2-TZVPP
keywords: def2/J RIJCOSX
keywords: DEFGRID2
keywords: scfconv7
keywords: smallprint printgap noloewdin
keywords: NOSOSCF
formula: C23H26O3
InChI: InChI=1/C23H26O3/c1-16(2)13-20-21(23(20,3)4)22(24)25-15-17-9-8-12-19(14-17)26-18-10-6-5-7-11-18/h5-14,20-21H,15H2,1-4H3
52 atoms
O  0.733407 -2.655777 -0.21708
O  -0.107131 -1.602132 1.574969
O  3.095295 2.100622 0.263756
C  -2.843637 -2.354225 0.272241
C  -2.503379 -0.927384 -0.039771
C  -1.491445 -2.018138 -0.326992
C  -3.796871 -3.096583 -0.634111
C  -2.971061 -2.765499 1.718856
C  -3.128305 -0.188509 -1.155277
C  -0.244015 -2.053849 0.467169
C  -3.814481 0.953937 -1.06327
C  -4.413174 1.594712 -2.279791
C  -4.07313 1.688394 0.217645
C  2.046047 -2.690619 0.35278
C  2.864216 -1.53267 -0.145017
C  2.623104 -0.254196 0.346146
C  3.832499 -1.718627 -1.12431
C  3.314571 0.829375 -0.175796
C  4.551287 -0.634973 -1.606998
C  4.288592 0.644754 -1.147715
C  1.81616 2.502617 0.528102
C  1.623334 3.334202 1.621145
C  0.74334 2.138875 -0.277724
C  0.349941 3.801939 1.908429
C  -0.526149 2.601248 0.029202
C  -0.730316 3.432486 1.121368
H  -2.252845 -0.334241 0.833577
H  -1.366063 -2.301505 -1.366448
H  -4.830666 -2.868971 -0.368657
H  -3.656285 -4.174103 -0.534005
H  -3.667451 -2.845413 -1.685968
H  -4.00303 -2.624949 2.045833
H  -2.329545 -2.192181 2.382398
H  -2.727905 -3.822365 1.846038
H  -3.025225 -0.630044 -2.142399
H  -4.015188 2.601395 -2.431992
H  -5.495675 1.702445 -2.173898
H  -4.221894 1.01981 -3.184999
H  -3.794904 2.74136 0.124832
H  -3.540895 1.278582 1.072955
H  -5.139946 1.673844 0.455611
H  2.480044 -3.634515 0.023252
H  1.991396 -2.700474 1.44192
H  1.887065 -0.104319 1.125709
H  4.025442 -2.710892 -1.512765
H  5.309456 -0.784213 -2.364231
H  4.827614 1.498966 -1.535659
H  2.468661 3.608578 2.238321
H  0.889751 1.494234 -1.134596
H  0.203245 4.450226 2.762249
H  -1.358303 2.300012 -0.594021
H  -1.724148 3.788931 1.35702
totalener: -1117.84775404 hartree
nucrepener: 2321.42948086 hartree
electener: -3439.27723490 hartree
oneelecener: -6131.58966296 hartree
twoeener: 2692.31242806 hartree
kineticenergy: 1112.84880888 hartree
xcener: -110.232956170641 hartree
chargesum: -0.0000000
charge: -0.262757 -0.406779 -0.302961 0.102224 0.024230 -0.091223 -0.239952 -0.264279 -0.175934 0.354061 -0.076762 -0.199925 -0.272635 0.056428 0.002625 -0.182500 -0.194008 0.236092 -0.078601 -0.218297 0.269636 -0.218845 -0.200333 -0.080868 -0.063766 -0.174827 0.094710 0.073035 0.090777 0.092007 0.071095 0.083693 0.103473 0.084323 0.077781 0.085100 0.087404 0.077665 0.079065 0.098020 0.105113 0.093078 0.117590 0.161129 0.106638 0.123813 0.124991 0.122624 0.125336 0.122632 0.142557 0.116310
qa: -0.2628 -0.4068 -0.3030 0.1022 0.0242 -0.0912 -0.2400 -0.2643 -0.1759 0.3541 -0.0768 -0.1999 -0.2726 0.0564 0.0026 -0.1825 -0.1940 0.2361 -0.0786 -0.2183 0.2696 -0.2188 -0.2003 -0.0809 -0.0638 -0.1748 0.0947 0.0730 0.0908 0.0920 0.0711 0.0837 0.1035 0.0843 0.0778 0.0851 0.0874 0.0777 0.0791 0.0980 0.1051 0.0931 0.1176 0.1611 0.1066 0.1238 0.1250 0.1226 0.1253 0.1226 0.1426 0.1163
va: 2.1375 2.0807 2.1131 3.7637 3.7520 3.9174 3.9144 3.9121 3.8361 4.1919 3.8099 3.9287 3.9478 3.8585 3.7399 3.8783 4.0324 3.8434 3.9365 4.0578 3.7896 4.0565 3.9856 3.9630 3.8712 3.9897 1.0294 1.0391 1.0050 1.0047 1.0102 1.0011 1.0222 1.0028 1.0198 0.9983 0.9977 1.0126 0.9938 1.0094 1.0029 0.9998 1.0143 1.0136 1.0124 0.9992 1.0126 1.0142 1.0096 0.9994 0.9823 1.0038
dispcorr: -0.027111081 hartree
energy: -1117.874865122914
dipole: -30.71604 30.16066 -0.55538 -3.47658 3.11487 -0.36171 -3.49920 2.96047 -0.53873
magnitude: 0.85412 au
magnitude: 2.17099 debye
