program: Orca
programVersion: 5.0.2
elementType: O O O C C C C C C C C C C C C C C C C C C C C C C C H H H H H H H H H H H H H H H H H H H H H H H H H H
charge: 0
multiplicity: 1
keywords: wb97x-d3
keywords: def2-TZVPP
keywords: def2/J RIJCOSX
keywords: DEFGRID2
keywords: scfconv7
keywords: smallprint printgap noloewdin
keywords: NOSOSCF
formula: C23H26O3
InChI: InChI=1/C23H26O3/c1-16(2)13-20-21(23(20,3)4)22(24)25-15-17-9-8-12-19(14-17)26-18-10-6-5-7-11-18/h5-14,20-21H,15H2,1-4H3
52 atoms
O  0.168162 -2.455842 0.572458
O  0.662129 -2.365542 -1.604527
O  2.498781 2.03537 0.951599
C  -2.769371 -2.548169 -0.450357
C  -2.409088 -1.236794 0.173709
C  -1.536082 -1.807841 -0.932028
C  -3.907277 -2.625178 -1.441481
C  -2.647182 -3.801951 0.382333
C  -3.173941 0.007869 -0.040547
C  -0.138019 -2.240467 -0.717972
C  -3.016785 1.1495 0.633934
C  -3.888221 2.335878 0.351334
C  -1.991326 1.372359 1.702467
C  1.52287 -2.7729 0.860919
C  2.44831 -1.607633 0.63758
C  2.03671 -0.315325 0.933686
C  3.729616 -1.819947 0.144905
C  2.886952 0.752201 0.687206
C  4.588481 -0.751159 -0.052334
C  4.167201 0.54471 0.200082
C  1.437808 2.578334 0.293416
C  1.001763 3.812695 0.764573
C  0.814541 1.987803 -0.800315
C  -0.052259 4.45502 0.138328
C  -0.24968 2.639959 -1.407289
C  -0.686455 3.873253 -0.951318
H  -1.975177 -1.336642 1.161645
H  -1.648294 -1.350283 -1.908476
H  -3.947734 -1.767456 -2.11168
H  -4.86654 -2.688854 -0.924339
H  -3.805874 -3.515091 -2.064591
H  -1.882576 -3.730051 1.151666
H  -2.415605 -4.66559 -0.244119
H  -3.596707 -4.003497 0.881513
H  -3.938355 -0.016299 -0.810636
H  -4.4542 2.625749 1.240523
H  -4.60118 2.142549 -0.449521
H  -3.284436 3.20154 0.069786
H  -2.466071 1.650673 2.646814
H  -1.333753 2.199479 1.426107
H  -1.361726 0.504903 1.889001
H  1.854297 -3.634293 0.276251
H  1.51844 -3.063854 1.912642
H  1.044723 -0.12607 1.326537
H  4.05205 -2.823424 -0.102777
H  5.583777 -0.923713 -0.439466
H  4.816553 1.390506 0.017876
H  1.498995 4.261833 1.614462
H  1.143675 1.033014 -1.188099
H  -0.379977 5.41802 0.507726
H  -0.735573 2.171159 -2.252469
H  -1.510045 4.376764 -1.439225
totalener: -1117.84420286 hartree
nucrepener: 2373.91147589 hartree
electener: -3491.75567875 hartree
oneelecener: -6236.39280118 hartree
twoeener: 2744.63712243 hartree
kineticenergy: 1112.86235521 hartree
xcener: -110.238901118857 hartree
chargesum: 0.0000000
charge: -0.286607 -0.348950 -0.297088 0.101588 0.041684 -0.055246 -0.280386 -0.254100 -0.199930 0.303446 -0.031983 -0.213912 -0.240422 0.036011 0.079703 -0.237038 -0.153810 0.229655 -0.097140 -0.187679 0.283269 -0.215658 -0.178585 -0.071686 -0.104163 -0.210318 0.091848 0.079272 0.074094 0.098061 0.093276 0.086278 0.091407 0.087166 0.077544 0.088563 0.075890 0.083098 0.100904 0.071331 0.066667 0.104277 0.103803 0.128895 0.103796 0.124959 0.123975 0.119243 0.139723 0.121446 0.121186 0.132643
qa: -0.2866 -0.3489 -0.2971 0.1016 0.0417 -0.0552 -0.2804 -0.2541 -0.1999 0.3034 -0.0320 -0.2139 -0.2404 0.0360 0.0797 -0.2370 -0.1538 0.2297 -0.0971 -0.1877 0.2833 -0.2157 -0.1786 -0.0717 -0.1042 -0.2103 0.0918 0.0793 0.0741 0.0981 0.0933 0.0863 0.0914 0.0872 0.0775 0.0886 0.0759 0.0831 0.1009 0.0713 0.0667 0.1043 0.1038 0.1289 0.1038 0.1250 0.1240 0.1192 0.1397 0.1214 0.1212 0.1326
va: 2.0825 2.1537 2.1165 3.8210 3.7174 3.7930 3.9259 3.8996 3.8930 4.2570 3.7848 3.9327 3.9598 3.8669 3.6331 3.9865 4.0132 3.8166 3.9446 4.0548 3.7845 4.0014 3.8786 3.8901 3.8885 3.9295 1.0190 1.0309 1.0086 1.0003 1.0041 1.0181 1.0025 1.0024 1.0191 0.9993 1.0121 1.0040 1.0064 1.0034 1.0209 1.0074 0.9903 1.0093 1.0117 0.9997 1.0110 1.0179 1.0112 1.0006 1.0059 0.9976
dispcorr: -0.030018320 hartree
energy: -1117.874221178453
dipole: -25.29592 24.79920 -0.49672 -2.58464 2.39460 -0.19005 1.05645 -0.59097 0.46548
magnitude: 0.70677 au
magnitude: 1.79647 debye
