program: Orca
programVersion: 5.0.2
elementType: O O O C C C C C C C C C C C C C C C C C C C C C C C H H H H H H H H H H H H H H H H H H H H H H H H H H
charge: 0
multiplicity: 1
keywords: wb97x-d3
keywords: def2-TZVPP
keywords: def2/J RIJCOSX
keywords: DEFGRID2
keywords: scfconv7
keywords: smallprint printgap noloewdin
keywords: NOSOSCF
formula: C23H26O3
InChI: InChI=1/C23H26O3/c1-16(2)13-20-21(23(20,3)4)22(24)25-15-17-9-8-12-19(14-17)26-18-10-6-5-7-11-18/h5-14,20-21H,15H2,1-4H3
52 atoms
O  -0.316192 -0.497023 1.509764
O  -0.616421 -2.638621 0.927453
O  4.163616 1.739156 -0.685035
C  -2.634354 -1.349003 -1.095675
C  -3.383159 -1.954334 0.053983
C  -2.244763 -0.995031 0.328243
C  -3.267635 -0.239248 -1.900778
C  -1.762222 -2.252405 -1.933305
C  -4.763609 -1.566081 0.399392
C  -0.994093 -1.496007 0.935824
C  -5.792325 -2.385496 0.62915
C  -7.146537 -1.839885 0.97245
C  -5.722313 -3.881984 0.574583
C  0.97016 -0.795801 2.05836
C  2.037385 -0.736658 1.002025
C  2.584203 0.495017 0.657337
C  2.468591 -1.88842 0.354378
C  3.550008 0.573536 -0.33704
C  3.439688 -1.800412 -0.631487
C  3.978558 -0.57582 -0.987659
C  3.500986 2.928432 -0.600127
C  2.205633 3.09066 -1.077474
C  4.194037 4.005546 -0.06774
C  1.608327 4.339271 -1.007472
C  3.588392 5.251584 -0.014403
C  2.292473 5.423519 -0.476642
H  -3.12343 -2.990197 0.242118
H  -2.52128 0.006686 0.639084
H  -3.950082 -0.648543 -2.647615
H  -2.49998 0.330015 -2.427897
H  -3.833249 0.462913 -1.289808
H  -1.35712 -3.090855 -1.37296
H  -0.923716 -1.699608 -2.361432
H  -2.349047 -2.655529 -2.760919
H  -4.953656 -0.499004 0.472447
H  -7.897517 -2.165897 0.248235
H  -7.157586 -0.750854 0.997869
H  -7.480152 -2.200628 1.948832
H  -6.412248 -4.270413 -0.178606
H  -6.029226 -4.316637 1.528902
H  -4.732733 -4.266122 0.339801
H  0.962256 -1.766419 2.555857
H  1.135681 -0.027354 2.813372
H  2.257129 1.390306 1.172776
H  2.040303 -2.846024 0.615375
H  3.77711 -2.696102 -1.135797
H  4.735083 -0.501884 -1.757778
H  1.668639 2.251854 -1.501391
H  5.203557 3.861812 0.29427
H  0.599867 4.464117 -1.379232
H  4.133146 6.090291 0.398466
H  1.820327 6.395291 -0.428766
totalener: -1117.84839712 hartree
nucrepener: 2195.67068722 hartree
electener: -3313.51908434 hartree
oneelecener: -5880.00050077 hartree
twoeener: 2566.48141644 hartree
kineticenergy: 1112.85446026 hartree
xcener: -110.231837098249 hartree
chargesum: 0.0000000
charge: -0.262217 -0.401625 -0.298826 0.090492 0.042920 -0.102189 -0.244867 -0.259400 -0.183832 0.364786 -0.051962 -0.203442 -0.236614 0.044367 -0.009577 -0.190534 -0.146905 0.238118 -0.092778 -0.209580 0.253620 -0.173858 -0.212380 -0.109227 -0.090370 -0.146570 0.088324 0.070059 0.092368 0.089842 0.070095 0.098511 0.085816 0.085783 0.070681 0.082858 0.076254 0.084335 0.084936 0.086147 0.083607 0.110468 0.102133 0.118472 0.127293 0.125439 0.124893 0.133129 0.125102 0.125917 0.125180 0.124814
qa: -0.2622 -0.4016 -0.2988 0.0905 0.0429 -0.1022 -0.2449 -0.2594 -0.1838 0.3648 -0.0520 -0.2034 -0.2366 0.0444 -0.0096 -0.1905 -0.1469 0.2381 -0.0928 -0.2096 0.2536 -0.1739 -0.2124 -0.1092 -0.0904 -0.1466 0.0883 0.0701 0.0924 0.0898 0.0701 0.0985 0.0858 0.0858 0.0707 0.0829 0.0763 0.0843 0.0849 0.0861 0.0836 0.1105 0.1021 0.1185 0.1273 0.1254 0.1249 0.1331 0.1251 0.1259 0.1252 0.1248
va: 2.1363 2.0995 2.1094 3.7350 3.7834 3.8856 3.9133 3.9132 3.8966 4.2193 3.8240 3.9353 3.9460 3.8698 3.7031 3.9637 3.9556 3.8423 3.9479 4.0326 3.8099 3.9528 4.0429 3.9395 3.9297 3.9642 1.0357 1.0388 1.0043 1.0044 1.0109 1.0229 1.0029 1.0011 1.0213 0.9983 1.0122 0.9984 0.9993 0.9991 1.0157 1.0101 0.9977 1.0137 1.0235 0.9993 1.0129 1.0038 1.0140 0.9999 0.9990 1.0006
dispcorr: -0.023111658 hartree
energy: -1117.871508778240
dipole: -34.48881 33.93486 -0.55394 -10.96685 11.47200 0.50515 -4.43394 4.37755 -0.05639
magnitude: 0.75180 au
magnitude: 1.91093 debye
