program: Orca
programVersion: 5.0.2
elementType: O O O C C C C C C C C C C C C C C C C C C C C C C C H H H H H H H H H H H H H H H H H H H H H H H H H H
charge: 0
multiplicity: 1
keywords: wb97x-d3
keywords: def2-TZVPP
keywords: def2/J RIJCOSX
keywords: DEFGRID2
keywords: scfconv7
keywords: smallprint printgap noloewdin
keywords: NOSOSCF
formula: C23H26O3
InChI: InChI=1/C23H26O3/c1-16(2)13-20-21(23(20,3)4)22(24)25-15-17-9-8-12-19(14-17)26-18-10-6-5-7-11-18/h5-14,20-21H,15H2,1-4H3
52 atoms
O  -0.24136 -0.525928 1.391657
O  -0.51352 -2.722358 1.043871
O  4.243092 1.877353 -0.748082
C  -2.771864 -1.768783 -0.887275
C  -3.379592 -2.164919 0.421905
C  -2.231495 -1.186032 0.409291
C  -3.515939 -0.797542 -1.771062
C  -1.981166 -2.791869 -1.666058
C  -4.722599 -1.705528 0.863347
C  -0.923244 -1.592853 0.964493
C  -5.880942 -2.189678 0.414118
C  -7.194101 -1.69175 0.93659
C  -5.971837 -3.265216 -0.625529
C  1.064566 -0.736084 1.935921
C  2.117354 -0.644972 0.868535
C  2.672246 0.593293 0.565622
C  2.52835 -1.775473 0.171414
C  3.629852 0.701682 -0.434106
C  3.489908 -1.65756 -0.820742
C  4.040653 -0.425814 -1.132563
C  3.591346 3.059833 -0.542556
C  2.325217 3.291233 -1.066118
C  4.254379 4.051454 0.163885
C  1.725436 4.524833 -0.871336
C  3.646798 5.285513 0.343408
C  2.380713 5.525976 -0.167745
H  -3.095365 -3.158058 0.762147
H  -2.48531 -0.144797 0.577011
H  -4.234184 -1.326283 -2.400818
H  -2.82123 -0.272613 -2.428997
H  -4.069946 -0.052898 -1.201218
H  -1.501434 -3.531662 -1.031174
H  -1.206299 -2.312652 -2.26734
H  -2.647273 -3.31984 -2.352016
H  -4.746633 -0.93369 1.627537
H  -7.766224 -2.50135 1.39674
H  -7.813429 -1.294335 0.1285
H  -7.068175 -0.90632 1.68093
H  -6.559538 -2.927914 -1.482978
H  -6.483721 -4.14471 -0.226232
H  -4.997148 -3.583829 -0.989728
H  1.11524 -1.693167 2.456079
H  1.195415 0.058812 2.670334
H  2.356851 1.470142 1.118325
H  2.094538 -2.738692 0.402213
H  3.81343 -2.53608 -1.363113
H  4.791276 -0.330503 -1.906062
H  1.814141 2.515006 -1.621251
H  5.240717 3.853247 0.562336
H  0.739891 4.705364 -1.279745
H  4.166775 6.059829 0.891787
H  1.908007 6.487653 -0.022111
totalener: -1117.84737588 hartree
nucrepener: 2187.37010197 hartree
electener: -3305.21747785 hartree
oneelecener: -5863.46386348 hartree
twoeener: 2558.24638563 hartree
kineticenergy: 1112.85555042 hartree
xcener: -110.230750141228 hartree
chargesum: -0.0000000
charge: -0.262966 -0.404772 -0.299101 0.067878 -0.032776 -0.090465 -0.246948 -0.265042 -0.189310 0.367523 -0.021217 -0.211277 -0.244906 0.044468 -0.010715 -0.176156 -0.153226 0.222376 -0.095335 -0.203278 0.231030 -0.158772 -0.197610 -0.113422 -0.099094 -0.139306 0.108454 0.080641 0.083616 0.096647 0.082630 0.104215 0.090207 0.079339 0.089216 0.086630 0.084050 0.079430 0.087872 0.098190 0.083817 0.112081 0.098589 0.115602 0.133373 0.125515 0.124658 0.132947 0.126158 0.127103 0.125726 0.125716
qa: -0.2630 -0.4048 -0.2991 0.0679 -0.0328 -0.0905 -0.2469 -0.2650 -0.1893 0.3675 -0.0212 -0.2113 -0.2449 0.0445 -0.0107 -0.1762 -0.1532 0.2224 -0.0953 -0.2033 0.2310 -0.1588 -0.1976 -0.1134 -0.0991 -0.1393 0.1085 0.0806 0.0836 0.0966 0.0826 0.1042 0.0902 0.0793 0.0892 0.0866 0.0841 0.0794 0.0879 0.0982 0.0838 0.1121 0.0986 0.1156 0.1334 0.1255 0.1247 0.1329 0.1262 0.1271 0.1257 0.1257
va: 2.1387 2.0950 2.1063 3.7303 3.8211 3.8557 3.9062 3.9044 3.8576 4.2153 3.7366 3.9376 3.9349 3.8631 3.7233 3.9576 3.9528 3.8564 3.9541 4.0278 3.8278 3.9604 4.0366 3.9415 3.9335 3.9565 1.0252 1.0346 1.0024 1.0060 1.0073 1.0227 1.0031 1.0026 1.0129 0.9981 0.9990 1.0107 0.9987 1.0037 1.0105 1.0122 0.9995 1.0148 1.0215 0.9995 1.0129 1.0034 1.0128 0.9997 0.9991 1.0003
dispcorr: -0.023938400 hartree
energy: -1117.871314281385
dipole: -36.11871 35.43964 -0.67907 -11.60181 12.17472 0.57290 -5.71073 5.59893 -0.11180
magnitude: 0.89546 au
magnitude: 2.27609 debye
