program: Orca
programVersion: 5.0.2
elementType: O O O C C C C C C C C C C C C C C C C C C C C C C C H H H H H H H H H H H H H H H H H H H H H H H H H H
charge: 0
multiplicity: 1
keywords: wb97x-d3
keywords: def2-TZVPP
keywords: def2/J RIJCOSX
keywords: DEFGRID2
keywords: scfconv7
keywords: smallprint printgap noloewdin
keywords: NOSOSCF
formula: C23H26O3
InChI: InChI=1/C23H26O3/c1-16(2)13-20-21(23(20,3)4)22(24)25-15-17-9-8-12-19(14-17)26-18-10-6-5-7-11-18/h5-14,20-21H,15H2,1-4H3
52 atoms
O  0.646005 -2.087382 -1.460503
O  0.158137 -2.750862 0.618322
O  2.807662 2.197879 0.402948
C  -2.797794 -2.608899 -0.381451
C  -2.461957 -1.341501 0.342307
C  -1.556795 -1.833555 -0.77764
C  -3.91574 -2.622626 -1.397816
C  -2.692941 -3.911171 0.37613
C  -3.229711 -0.095315 0.181133
C  -0.190805 -2.281677 -0.431886
C  -3.393747 0.871947 1.088832
C  -4.247042 2.068017 0.78324
C  -2.776434 0.885305 2.454206
C  2.020765 -2.377633 -1.227333
C  2.658835 -1.408171 -0.270609
C  2.424965 -0.04553 -0.41615
C  3.486759 -1.862969 0.744349
C  2.98883 0.851033 0.48053
C  4.08017 -0.955696 1.609312
C  3.827388 0.399221 1.492248
C  1.683295 2.734165 -0.152482
C  1.853083 3.861361 -0.944083
C  0.409618 2.233334 0.092816
C  0.745948 4.488788 -1.493539
C  -0.686903 2.85977 -0.478544
C  -0.527692 3.987835 -1.270359
H  -2.0376 -1.507908 1.326026
H  -1.627898 -1.301279 -1.719527
H  -4.88438 -2.708153 -0.902286
H  -3.806986 -3.479756 -2.064286
H  -3.941835 -1.731518 -2.023654
H  -2.471991 -4.738778 -0.30076
H  -3.647858 -4.127153 0.858748
H  -1.92524 -3.894713 1.144686
H  -3.72083 0.040971 -0.777514
H  -5.095299 2.128209 1.470039
H  -4.643036 2.042496 -0.231566
H  -3.686819 2.999163 0.904897
H  -2.144126 1.768589 2.576216
H  -2.163666 0.01316 2.668912
H  -3.546598 0.947888 3.22657
H  2.48353 -2.307461 -2.212697
H  2.14625 -3.402256 -0.869673
H  1.789706 0.30988 -1.217754
H  3.652803 -2.924766 0.872692
H  4.725902 -1.309244 2.402115
H  4.268287 1.110486 2.178024
H  2.850948 4.24084 -1.12053
H  0.266249 1.358626 0.714736
H  0.884446 5.36873 -2.107797
H  -1.671169 2.447639 -0.30124
H  -1.389823 4.471501 -1.709374
totalener: -1117.84749008 hartree
nucrepener: 2325.97944828 hartree
electener: -3443.82693835 hartree
oneelecener: -6140.61291735 hartree
twoeener: 2696.78597900 hartree
kineticenergy: 1112.85549638 hartree
xcener: -110.236349433085 hartree
chargesum: 0.0000000
charge: -0.275168 -0.380594 -0.298571 0.078084 0.051739 -0.069099 -0.260249 -0.255354 -0.187690 0.325643 -0.090367 -0.210349 -0.244896 0.071460 0.059021 -0.280546 -0.166771 0.299264 -0.072984 -0.238689 0.315152 -0.240274 -0.271722 -0.055858 -0.023569 -0.210902 0.094631 0.074641 0.096472 0.090618 0.074220 0.083126 0.085124 0.101916 0.075525 0.098056 0.083479 0.077575 0.086175 0.091190 0.094652 0.107804 0.098036 0.131886 0.101693 0.122662 0.122881 0.122951 0.144669 0.123637 0.130424 0.119244
qa: -0.2752 -0.3806 -0.2986 0.0781 0.0517 -0.0691 -0.2602 -0.2554 -0.1877 0.3256 -0.0904 -0.2103 -0.2449 0.0715 0.0590 -0.2805 -0.1668 0.2993 -0.0730 -0.2387 0.3152 -0.2403 -0.2717 -0.0559 -0.0236 -0.2109 0.0946 0.0746 0.0965 0.0906 0.0742 0.0831 0.0851 0.1019 0.0755 0.0981 0.0835 0.0776 0.0862 0.0912 0.0947 0.1078 0.0980 0.1319 0.1017 0.1227 0.1229 0.1230 0.1447 0.1236 0.1304 0.1192
va: 2.1158 2.1213 2.1256 3.7899 3.7540 3.8078 3.9174 3.9083 3.8674 4.2376 3.8396 3.9103 3.9348 3.8623 3.6846 3.9479 4.0253 3.7864 3.9368 4.0528 3.7840 4.0636 4.0031 3.8998 3.8072 4.0461 1.0280 1.0366 1.0020 1.0049 1.0100 1.0031 1.0003 1.0240 1.0217 0.9991 1.0097 1.0010 0.9992 1.0145 1.0016 0.9885 1.0098 1.0184 1.0140 0.9993 1.0144 1.0153 0.9981 0.9986 0.9956 1.0063
dispcorr: -0.026945441 hartree
energy: -1117.874435516982
dipole: -27.51267 26.93324 -0.57942 -3.98841 4.03208 0.04367 2.56289 -3.01075 -0.44785
magnitude: 0.73363 au
magnitude: 1.86474 debye
