program: Orca
programVersion: 5.0.2
elementType: O O O C C C C C C C C C C C C C C C C C C C C C C C H H H H H H H H H H H H H H H H H H H H H H H H H H
charge: 0
multiplicity: 1
keywords: wb97x-d3
keywords: def2-TZVPP
keywords: def2/J RIJCOSX
keywords: DEFGRID2
keywords: scfconv7
keywords: smallprint printgap noloewdin
keywords: NOSOSCF
formula: C23H26O3
InChI: InChI=1/C23H26O3/c1-16(2)13-20-21(23(20,3)4)22(24)25-15-17-9-8-12-19(14-17)26-18-10-6-5-7-11-18/h5-14,20-21H,15H2,1-4H3
52 atoms
O  -0.093684 -0.751262 1.69753
O  -0.483631 -2.728808 0.724684
O  4.046376 1.778258 -0.647367
C  -2.55463 -1.021934 -0.890573
C  -3.255756 -1.856624 0.139665
C  -2.102195 -0.978886 0.559264
C  -3.243165 0.218481 -1.40658
C  -1.719672 -1.712976 -1.940581
C  -4.623992 -1.543319 0.608161
C  -0.830828 -1.605378 0.980943
C  -5.715122 -2.277153 0.381993
C  -7.052739 -1.859226 0.914693
C  -5.721434 -3.55101 -0.407277
C  1.220396 -1.171343 2.07239
C  2.189139 -0.958764 0.943822
C  2.660846 0.324522 0.689787
C  2.589907 -2.013427 0.132717
C  3.517298 0.551019 -0.378431
C  3.458252 -1.779662 -0.922736
C  3.918812 -0.501213 -1.189884
C  3.29888 2.90723 -0.486389
C  1.956849 2.973042 -0.842284
C  3.951857 4.030847 0.00035
C  1.273777 4.170334 -0.696243
C  3.258905 5.224081 0.130005
C  1.91667 5.299396 -0.210467
H  -3.001694 -2.911053 0.101072
H  -2.348141 -0.063993 1.088146
H  -2.515442 0.915265 -1.826082
H  -3.801276 0.746402 -0.634402
H  -3.94967 -0.042671 -2.196476
H  -0.904613 -1.069874 -2.278948
H  -2.341573 -1.939782 -2.808566
H  -1.283504 -2.644978 -1.591036
H  -4.740799 -0.631068 1.186354
H  -6.998056 -0.928007 1.477211
H  -7.470469 -2.624432 1.573776
H  -7.772663 -1.720873 0.104123
H  -6.397324 -3.466382 -1.2619
H  -6.090921 -4.382574 0.19784
H  -4.742237 -3.826507 -0.792481
H  1.21653 -2.21186 2.399796
H  1.479245 -0.545928 2.926611
H  2.357122 1.14598 1.328156
H  2.213589 -3.009566 0.319798
H  3.771566 -2.600427 -1.554047
H  4.591699 -0.311681 -2.015736
H  1.447461 2.100537 -1.230391
H  4.997972 3.963204 0.268377
H  0.228899 4.219066 -0.973037
H  3.772775 6.098126 0.507844
H  1.377275 6.230603 -0.103377
totalener: -1117.84791042 hartree
nucrepener: 2215.07320346 hartree
electener: -3332.92111388 hartree
oneelecener: -5918.80349372 hartree
twoeener: 2585.88237984 hartree
kineticenergy: 1112.86171110 hartree
xcener: -110.232558035887 hartree
chargesum: -0.0000000
charge: -0.262830 -0.398615 -0.299747 0.121481 0.008838 -0.127371 -0.232107 -0.267159 -0.195439 0.362804 -0.032290 -0.209290 -0.237152 0.047342 -0.006833 -0.193624 -0.138602 0.233309 -0.094250 -0.206641 0.253761 -0.167270 -0.216755 -0.110983 -0.087889 -0.149485 0.094801 0.073274 0.088386 0.072924 0.089059 0.085594 0.084094 0.100662 0.079845 0.076983 0.085712 0.083348 0.084213 0.088394 0.082896 0.108524 0.105590 0.120072 0.122564 0.125631 0.125564 0.130015 0.124596 0.124908 0.124858 0.124288
qa: -0.2628 -0.3986 -0.2997 0.1215 0.0088 -0.1274 -0.2321 -0.2672 -0.1954 0.3628 -0.0323 -0.2093 -0.2372 0.0473 -0.0068 -0.1936 -0.1386 0.2333 -0.0942 -0.2066 0.2538 -0.1673 -0.2168 -0.1110 -0.0879 -0.1495 0.0948 0.0733 0.0884 0.0729 0.0891 0.0856 0.0841 0.1007 0.0798 0.0770 0.0857 0.0833 0.0842 0.0884 0.0829 0.1085 0.1056 0.1201 0.1226 0.1256 0.1256 0.1300 0.1246 0.1249 0.1249 0.1243
va: 2.1362 2.1030 2.1084 3.7215 3.7815 3.9368 3.9048 3.9100 3.8931 4.2215 3.7756 3.9387 3.9485 3.8714 3.6867 3.9660 3.9571 3.8394 3.9459 4.0350 3.8150 3.9408 4.0393 3.9431 3.9316 3.9664 1.0315 1.0392 1.0053 1.0098 1.0062 1.0036 1.0020 1.0225 1.0176 1.0116 0.9981 0.9984 0.9997 0.9997 1.0128 1.0103 0.9961 1.0139 1.0236 0.9993 1.0123 1.0043 1.0145 1.0002 0.9988 1.0007
dispcorr: -0.023758507 hartree
energy: -1117.871668926375
dipole: -34.50090 33.91775 -0.58315 -8.78444 9.23209 0.44765 -5.45425 5.44970 -0.00455
magnitude: 0.73517 au
magnitude: 1.86866 debye
