program: Orca
programVersion: 5.0.2
elementType: O O O C C C C C C C C C C C C C C C C C C C C C C C H H H H H H H H H H H H H H H H H H H H H H H H H H
charge: 0
multiplicity: 1
keywords: wb97x-d3
keywords: def2-TZVPP
keywords: def2/J RIJCOSX
keywords: DEFGRID2
keywords: scfconv7
keywords: smallprint printgap noloewdin
keywords: NOSOSCF
formula: C23H26O3
InChI: InChI=1/C23H26O3/c1-16(2)13-20-21(23(20,3)4)22(24)25-15-17-9-8-12-19(14-17)26-18-10-6-5-7-11-18/h5-14,20-21H,15H2,1-4H3
52 atoms
O  -0.174014 -0.660628 1.759213
O  -0.5218 -2.631076 0.757766
O  4.046334 1.650934 -0.56388
C  -2.490124 -0.89679 -0.96889
C  -3.253898 -1.728688 0.018566
C  -2.109771 -0.861633 0.499749
C  -3.108814 0.363969 -1.523811
C  -1.615173 -1.607079 -1.973044
C  -4.63314 -1.415262 0.431745
C  -0.872936 -1.504484 0.993229
C  -5.637471 -2.27915 0.598848
C  -6.99472 -1.802286 1.02312
C  -5.53797 -3.76034 0.39392
C  1.101152 -1.104869 2.224347
C  2.146237 -0.975341 1.152532
C  2.593681 0.291338 0.793921
C  2.656507 -2.093927 0.506263
C  3.541361 0.434545 -0.209228
C  3.616508 -1.941918 -0.48271
C  4.058196 -0.682033 -0.851271
C  3.22347 2.733536 -0.662687
C  1.944179 2.652785 -1.200421
C  3.736582 3.955937 -0.251463
C  1.182792 3.80547 -1.316098
C  2.967246 5.101245 -0.382209
C  1.685911 5.032435 -0.908926
H  -3.000409 -2.782176 -0.01764
H  -2.37619 0.052658 1.01892
H  -2.332739 1.034005 -1.898206
H  -3.688304 0.918584 -0.787172
H  -3.774707 0.127932 -2.355665
H  -1.210047 -2.542601 -1.596432
H  -0.774875 -0.97805 -2.274661
H  -2.197019 -1.831371 -2.868978
H  -4.84598 -0.367307 0.621843
H  -7.753868 -2.06767 0.282863
H  -7.026573 -0.722164 1.161695
H  -7.300249 -2.269718 1.962683
H  -5.804928 -4.292934 1.309974
H  -4.548499 -4.097066 0.094608
H  -6.243798 -4.090043 -0.372433
H  1.04467 -2.129105 2.596261
H  1.331037 -0.450372 3.065157
H  2.202391 1.166139 1.30036
H  2.294672 -3.078602 0.768785
H  4.015836 -2.813323 -0.984316
H  4.802211 -0.5559 -1.626698
H  1.544163 1.7019 -1.528211
H  4.735963 4.00103 0.160979
H  0.186901 3.740078 -1.734332
H  3.372555 6.052238 -0.06261
H  1.085958 5.92713 -1.004259
totalener: -1117.84838843 hartree
nucrepener: 2224.23317855 hartree
electener: -3342.08156698 hartree
oneelecener: -5937.10138843 hartree
twoeener: 2595.01982145 hartree
kineticenergy: 1112.85973214 hartree
xcener: -110.232943904092 hartree
chargesum: -0.0000000
charge: -0.263827 -0.396751 -0.300520 0.075392 0.042605 -0.085077 -0.248146 -0.249601 -0.185781 0.356445 -0.053020 -0.202812 -0.235971 0.049991 -0.012981 -0.186854 -0.123953 0.220660 -0.097383 -0.201187 0.240750 -0.155049 -0.211976 -0.115899 -0.090618 -0.146347 0.087982 0.072728 0.086647 0.072014 0.093469 0.099313 0.081093 0.085807 0.070238 0.083173 0.075806 0.084491 0.086049 0.083691 0.084726 0.105280 0.109303 0.120724 0.117351 0.124606 0.125749 0.131195 0.124451 0.123058 0.124411 0.124554
qa: -0.2638 -0.3968 -0.3005 0.0754 0.0426 -0.0851 -0.2481 -0.2496 -0.1858 0.3564 -0.0530 -0.2028 -0.2360 0.0500 -0.0130 -0.1869 -0.1240 0.2207 -0.0974 -0.2012 0.2408 -0.1550 -0.2120 -0.1159 -0.0906 -0.1463 0.0880 0.0727 0.0866 0.0720 0.0935 0.0993 0.0811 0.0858 0.0702 0.0832 0.0758 0.0845 0.0860 0.0837 0.0847 0.1053 0.1093 0.1207 0.1174 0.1246 0.1257 0.1312 0.1245 0.1231 0.1244 0.1246
va: 2.1313 2.1075 2.1057 3.7497 3.7923 3.8566 3.9173 3.9115 3.9054 4.2351 3.8291 3.9341 3.9449 3.8726 3.6860 3.9556 3.9613 3.8419 3.9484 4.0309 3.8306 3.9348 4.0342 3.9490 3.9345 3.9652 1.0353 1.0369 1.0048 1.0110 1.0039 1.0235 1.0041 1.0009 1.0219 0.9981 1.0123 0.9984 0.9990 1.0166 0.9991 1.0104 0.9944 1.0152 1.0223 0.9996 1.0119 1.0025 1.0144 1.0009 0.9989 1.0007
dispcorr: -0.023673784 hartree
energy: -1117.872062212853
dipole: -33.65184 33.09293 -0.55891 -8.61204 9.00833 0.39629 -4.53344 4.56570 0.03226
magnitude: 0.68591 au
magnitude: 1.74344 debye
