program: Orca
programVersion: 5.0.2
elementType: O O O C C C C C C C C C C C C C C C C C C C C C C C H H H H H H H H H H H H H H H H H H H H H H H H H H
charge: 0
multiplicity: 1
keywords: wb97x-d3
keywords: def2-TZVPP
keywords: def2/J RIJCOSX
keywords: DEFGRID2
keywords: scfconv7
keywords: smallprint printgap noloewdin
keywords: NOSOSCF
formula: C23H26O3
InChI: InChI=1/C23H26O3/c1-16(2)13-20-21(23(20,3)4)22(24)25-15-17-9-8-12-19(14-17)26-18-10-6-5-7-11-18/h5-14,20-21H,15H2,1-4H3
52 atoms
O  -0.264043 -1.498176 -1.351186
O  -0.236759 -3.313118 -0.038503
O  1.96863 2.962728 0.719368
C  -3.300665 -3.397303 -0.788736
C  -3.093462 -2.839158 0.576968
C  -2.31217 -2.261176 -0.587589
C  -4.555289 -3.02701 -1.544163
C  -2.812152 -4.792305 -1.092154
C  -4.109207 -2.011343 1.275585
C  -0.848101 -2.448484 -0.612983
C  -3.828162 -0.988847 2.085052
C  -4.913228 -0.213742 2.768796
C  -2.432144 -0.527128 2.375898
C  1.161464 -1.415527 -1.32179
C  1.610043 -0.576535 -0.15841
C  1.613647 0.80751 -0.278891
C  1.970876 -1.160125 1.052426
C  1.986715 1.599622 0.797858
C  2.328681 -0.360024 2.126128
C  2.344542 1.02113 2.005527
C  2.611197 3.586038 -0.308908
C  3.761987 3.073323 -0.896191
C  2.092499 4.803691 -0.729291
C  4.381502 3.784941 -1.91231
C  2.727867 5.50681 -1.740092
C  3.870908 5.000587 -2.341455
H  -2.486098 -3.466968 1.224896
H  -2.643701 -1.296544 -0.953999
H  -5.375971 -3.696744 -1.278835
H  -4.394993 -3.11309 -2.620022
H  -4.880342 -2.007353 -1.337697
H  -3.597232 -5.51463 -0.860941
H  -1.930452 -5.064757 -0.517606
H  -2.569853 -4.898842 -2.151206
H  -5.150461 -2.285391 1.130742
H  -4.865805 0.844918 2.501319
H  -4.807509 -0.264393 3.855236
H  -5.905766 -0.58112 2.510888
H  -2.263449 0.476657 1.976786
H  -1.665514 -1.178749 1.963331
H  -2.265982 -0.461724 3.45369
H  1.437726 -0.9445 -2.265099
H  1.610774 -2.408765 -1.291177
H  1.325651 1.271085 -1.215565
H  1.959045 -2.236598 1.155016
H  2.607639 -0.815223 3.067133
H  2.631969 1.651512 2.836623
H  4.178026 2.131114 -0.564176
H  1.197944 5.191745 -0.260153
H  5.277683 3.383069 -2.36648
H  2.318923 6.454875 -2.063879
H  4.360504 5.54979 -3.133954
totalener: -1117.84703684 hartree
nucrepener: 2219.35251462 hartree
electener: -3337.19955146 hartree
oneelecener: -5927.44865205 hartree
twoeener: 2590.24910059 hartree
kineticenergy: 1112.85973208 hartree
xcener: -110.231565992236 hartree
chargesum: 0.0000000
charge: -0.260247 -0.401475 -0.301739 0.132568 -0.025056 -0.091481 -0.273605 -0.258585 -0.244372 0.332969 -0.000450 -0.212598 -0.214981 0.048663 0.003773 -0.176902 -0.139991 0.195101 -0.106642 -0.182976 0.240264 -0.150419 -0.209370 -0.125399 -0.091567 -0.147322 0.103374 0.082826 0.090366 0.090854 0.084634 0.082580 0.100446 0.084883 0.092952 0.085070 0.086391 0.077949 0.091063 0.077034 0.086326 0.104686 0.109603 0.118919 0.130018 0.127163 0.127001 0.129607 0.124141 0.125688 0.123866 0.124399
qa: -0.2602 -0.4015 -0.3017 0.1326 -0.0251 -0.0915 -0.2736 -0.2586 -0.2444 0.3330 -0.0005 -0.2126 -0.2150 0.0487 0.0038 -0.1769 -0.1400 0.1951 -0.1066 -0.1830 0.2403 -0.1504 -0.2094 -0.1254 -0.0916 -0.1473 0.1034 0.0828 0.0904 0.0909 0.0846 0.0826 0.1004 0.0849 0.0930 0.0851 0.0864 0.0779 0.0911 0.0770 0.0863 0.1047 0.1096 0.1189 0.1300 0.1272 0.1270 0.1296 0.1241 0.1257 0.1239 0.1244
va: 2.1241 2.0918 2.1013 3.7305 3.8289 3.8043 3.9110 3.9000 3.8977 4.2141 3.7387 3.9421 3.9491 3.8582 3.6662 3.9836 3.9287 3.8581 3.9442 4.0327 3.8173 3.9106 4.0278 3.9591 3.9420 3.9604 1.0283 1.0335 1.0011 1.0065 1.0049 1.0023 1.0210 1.0021 1.0103 0.9986 0.9991 1.0096 1.0010 1.0161 1.0032 0.9958 1.0141 1.0134 1.0213 0.9995 1.0105 1.0065 1.0143 1.0003 0.9988 1.0006
dispcorr: -0.024499134 hartree
energy: -1117.871535973244
dipole: -24.30727 24.18989 -0.11738 -12.14190 12.50220 0.36030 2.53433 -2.83945 -0.30513
magnitude: 0.48651 au
magnitude: 1.23662 debye
