program: Gaussian 09
title: 000071901
version: EM64L-G09RevD.01
frameworkgroup: C1[X(C18H23NO)]
method: RPBEPBE
basis: SDD
operation: Freq
keyword: #p
keyword: freq=noraman
keyword: PBEPBE/SDD
title: #p freq=noraman PBEPBE/SDD
converged: YES YES NO NO
title: Mulliken charges:
elementType: O N C C C C C C C C C C C C C C C C C C H H H H H H H H H H H H H H H H H H H H H H H
charge: -0.279053 -0.316259 -0.075042 -0.068615 -0.589063 -0.729498 -0.344095 0.517902 -0.719099 -0.427261 -0.395710 -0.228246 -0.232527 0.376647 -0.244104 -0.345929 -0.385521 -0.225505 -0.197858 -0.257649 0.236686 0.203977 0.195448 0.225508 0.232527 0.237230 0.190690 0.237838 0.221300 0.196622 0.249617 0.220715 0.213405 0.230660 0.224848 0.223321 0.223313 0.227354 0.250915 0.248367 0.222652 0.226310 0.227180
chargesum: 0.00000
title: Mulliken charges with hydrogens summed into heavy atoms:
elementType: O N C C C C C C C C C C C C C C C C C C
charge: -0.279053 -0.083732 0.161644 0.135362 -0.168107 -0.063739 0.073826 0.517902 -0.035361 -0.196602 -0.170861 -0.004925 -0.009213 0.376647 -0.016750 -0.095014 -0.137154 -0.002853 0.028452 -0.030469
polarizability: 3.06292697e+02 -4.46924721e+00 1.82648871e+02 2.40609522e+00 -9.34342915e+00 1.30458601e+02
1716.lowfreq: -3.5308 -0.0005 0.0005 0.0007 5.6397 10.2058 18.9425 23.3252 29.9222
frequency: 18.8124 23.2290 29.8811 44.3196 53.7929 82.7726 93.4625 94.4309 135.5313 169.0035 208.5319 228.5514 230.9150 241.8838 251.1494 264.0975 340.6822 350.8882 382.4634 404.6610 410.4525 411.2174 428.6915 494.3117 499.6033 503.0954 512.4841 583.3217 601.0703 611.0265 617.8738 659.6605 692.1899 705.0806 749.5769 759.0329 791.0768 819.4161 823.1803 845.1139 852.2218 856.9345 887.9959 889.4770 915.1594 923.1283 930.4818 961.5285 973.6839 978.3319 981.8804 984.3437 989.3539 991.8937 993.7762 1022.6859 1026.3843 1046.4546 1077.0234 1083.3981 1097.5913 1104.5591 1138.3386 1155.6392 1167.1195 1171.3622 1175.8569 1178.4053 1186.7864 1210.5981 1219.1616 1222.2311 1229.8591 1271.5287 1311.1701 1314.2557 1318.2272 1326.9285 1334.8693 1354.4749 1370.4581 1381.1189 1381.9737 1386.5962 1391.7373 1439.5230 1443.4708 1457.8562 1466.5732 1468.6235 1476.2531 1478.3774 1479.6240 1482.7267 1484.1039 1484.9134 1590.5753 1591.3328 1612.0429 1612.6367 2883.8097 2944.1083 2971.8426 2974.8326 2985.8183 3005.6296 3020.4662 3034.4259 3070.3094 3080.6484 3098.2628 3100.5248 3109.3900 3115.3176 3127.1817 3130.3004 3136.1380 3141.9463 3154.3142 3161.1743 3162.4480 3171.9263 3409.2821
redmass: 4.8165 4.2678 4.0305 3.8649 3.7553 3.7127 3.7092 4.1127 3.6348 2.3422 3.9557 1.5259 4.3902 1.8278 3.5887 1.1353 2.7126 2.4558 3.3493 2.8197 2.4063 2.8332 2.4264 3.3891 2.8414 2.8544 2.8430 3.9002 4.4952 6.1821 6.2575 1.8786 2.0645 1.7675 1.8624 1.6435 5.0952 3.9455 1.2556 2.2170 1.2792 2.5557 1.4450 1.4497 1.5504 1.7626 1.2798 1.3585 1.3875 4.7198 1.3003 2.4428 6.1060 1.6664 2.3661 2.0525 2.1922 1.6193 1.7733 1.5680 1.9931 1.8696 1.7576 2.2182 1.0921 1.0702 1.7634 1.2993 1.1149 1.9165 2.5469 1.9943 1.5013 1.2643 1.2448 1.3010 1.3081 1.3715 1.2353 1.4006 1.6219 1.9356 3.0173 1.2610 3.0759 2.1634 2.3549 1.1833 1.1084 1.1263 1.1541 1.1500 1.2955 1.6749 1.3565 1.2408 5.9894 6.4287 6.2092 6.1747 1.0812 1.0581 1.0418 1.0578 1.0365 1.0827 1.1046 1.1016 1.0940 1.0995 1.0991 1.1002 1.0874 1.0866 1.0847 1.0904 1.0889 1.0957 1.0924 1.1014 1.0954 1.1007 1.0734
irintensity: 0.0660 0.0794 0.0444 0.0163 0.2965 0.1406 0.5039 0.4620 2.1033 3.1940 0.4007 0.4357 0.9728 1.4058 2.9388 0.7075 2.3257 1.8040 2.9996 0.0049 1.9595 0.3457 3.0868 7.2645 3.1089 12.2304 14.3999 43.0919 2.1374 1.4865 0.2449 106.3275 32.8121 54.5022 31.6922 89.9914 6.8170 6.0756 0.2782 16.2646 1.3099 3.8177 2.8453 7.8494 0.7392 2.4741 5.5040 0.0664 0.1294 36.9008 0.5132 16.7677 1.7040 12.2746 23.8291 27.1886 6.8643 5.5281 8.1174 12.3104 7.0267 36.8408 0.4737 10.5879 18.3175 3.6767 189.0112 1.3183 0.7228 7.4116 245.7195 47.3531 6.3930 28.2453 15.3469 13.0766 2.5280 2.1624 4.1205 11.5319 2.9326 13.0567 12.0979 21.6724 13.5306 7.4702 2.4134 83.5397 3.5269 20.6953 11.7074 39.7376 35.4844 16.3778 30.0839 8.0197 2.3844 27.5130 103.4281 11.1201 54.7549 40.5857 26.8739 25.9631 16.5363 14.9075 38.7150 28.9773 40.9308 47.5778 26.7422 28.8759 15.2979 7.4084 3.5261 9.6232 11.8632 46.3472 34.9567 26.4453 22.3525 7.0199 2.2151
temp: 298.150 k
press: 1.00000 atm
elementType: 8 7 6 6 6 6 6 6 6 6 6 6 6 6 6 6 6 6 6 6 1 1 1 1 1 1 1 1 1 1 1 1 1 1 1 1 1 1 1 1 1 1 1
symmnumber: 1
zpe: 959956.8 jmol-1
zpe.correction: 0.365628 hartree
zpe.thermalcorrener: 0.385266 hartree
zpe.thermalcorrenthalpy: 0.386210 hartree
zpe.thermalcorrgfe: 0.314823 hartree
zpe.sumelectzpe: -828.182922 hartree
zpe.sumelectthermal: -828.163284 hartree
zpe.sumelectthermalent: -828.162340 hartree
zpe.sumelectthermalfe: -828.233727 hartree
dipole: 0.5484 1.0540 -0.3155
dipole: 1.2293
quadrupole: -114.5241 -115.1736 -124.0256
quadrupole: -1.6887 0.0233 -4.4774
quadrupole: 3.3837 2.7342 -6.1179 -1.6887 0.0233 -4.4774
hfenergy: -828.5485506 hartree
pointgroup: C01 [X(C18H23N1O1)]
dipole: -0.2156448 0.4096539 0.1399855 debye
polarizability: 306.2911478|4.2637845|181.830063|2.8420358|11.3640044|131.2789584 unknown
InChI: InChI=1S/C18H23NO/c1-15(13-17-9-5-3-6-10-17)19-16(2)14-20-18-11-7-4-8-12-18/h3-12,15-16,19H,13-14H2,1-2H3
charge 0 multiplicity 1
43 atoms
O  2.818314 -0.530036 0.081275
N  -0.390936 1.26503 -0.284953
C  -1.85366 1.073433 -0.434818
C  0.491909 0.071845 -0.222605
C  -2.5001 0.232453 0.729318
C  -2.516725 2.457848 -0.563798
C  1.93628 0.606321 -0.225099
C  -3.941208 -0.164845 0.456951
C  0.263503 -0.873458 -1.418021
C  -5.024503 0.478929 1.10978
C  -4.236789 -1.17973 -0.492793
C  -6.36251 0.122606 0.824372
C  -5.571707 -1.538008 -0.783698
C  4.202987 -0.297935 0.108429
C  -6.641687 -0.88706 -0.125493
C  4.808094 0.961035 -0.133915
C  5.002747 -1.430423 0.404879
C  6.217513 1.07285 -0.077246
C  6.404318 -1.30173 0.457537
C  7.022483 -0.04913 0.216788
H  -2.023717 0.519304 -1.377546
H  0.36592 -0.518725 0.717546
H  -2.431239 0.824871 1.663623
H  -1.88654 -0.678449 0.874847
H  -0.189342 1.920313 0.485316
H  -2.089166 3.006178 -1.420675
H  -2.348296 3.062041 0.350498
H  -3.606135 2.360829 -0.708271
H  2.18133 1.034766 -1.217518
H  2.063736 1.394376 0.548572
H  1.056496 -1.640358 -1.432106
H  0.296315 -0.305051 -2.365738
H  -0.709387 -1.392968 -1.355658
H  -4.815653 1.261911 1.849581
H  -3.412825 -1.699258 -0.999545
H  -7.184784 0.628809 1.343228
H  -5.778714 -2.326247 -1.516793
H  -7.67797 -1.166385 -0.346702
H  4.20542 1.844161 -0.365725
H  4.508108 -2.389484 0.588231
H  6.683229 2.046951 -0.26588
H  7.016914 -2.180971 0.686673
H  8.112477 0.047094 0.258052
