program: Orca
programVersion: 5.0.2
elementType: O O O C C C C C C C C C C C C C C C C C C C C C C C H H H H H H H H H H H H H H H H H H H H H H H H H H
charge: 0
multiplicity: 1
keywords: wb97x-d3
keywords: def2-TZVPP
keywords: def2/J RIJCOSX
keywords: DEFGRID2
keywords: scfconv7
keywords: smallprint printgap noloewdin
keywords: NOSOSCF
formula: C23H26O3
InChI: InChI=1/C23H26O3/c1-16(2)13-20-21(23(20,3)4)22(24)25-15-17-9-8-12-19(14-17)26-18-10-6-5-7-11-18/h5-14,20-21H,15H2,1-4H3
52 atoms
O  -0.12756 -0.609124 1.732124
O  -0.475507 -2.707405 1.033983
O  4.02609 1.678491 -0.894982
C  -2.611727 -1.226199 -0.741483
C  -3.265616 -2.003878 0.36059
C  -2.158257 -1.043253 0.698889
C  -3.360473 -0.061675 -1.341503
C  -1.741445 -1.952089 -1.737267
C  -4.653056 -1.727016 0.814567
C  -0.853613 -1.571165 1.155852
C  -5.749527 -2.223463 0.240478
C  -7.118162 -1.925133 0.772786
C  -5.711682 -3.115237 -0.962967
C  1.19919 -0.944564 2.1463
C  2.165641 -0.860769 0.998838
C  2.631285 0.387033 0.597125
C  2.58137 -2.002243 0.325378
C  3.503888 0.491119 -0.477122
C  3.462643 -1.888711 -0.739821
C  3.92261 -0.649515 -1.150557
C  3.327195 2.833556 -0.687193
C  2.023391 2.981477 -1.144718
C  3.97236 3.879385 -0.046039
C  1.367047 4.185297 -0.94799
C  3.308069 5.083943 0.134521
C  2.004154 5.240467 -0.309361
H  -2.961563 -3.046383 0.411111
H  -2.444621 -0.097627 1.147305
H  -2.666149 0.650676 -1.790918
H  -3.963253 0.471511 -0.607353
H  -4.037451 -0.406407 -2.12596
H  -1.242913 -2.819581 -1.311906
H  -0.973289 -1.290309 -2.142568
H  -2.352739 -2.29567 -2.574574
H  -4.769462 -1.089712 1.686533
H  -7.741641 -1.451275 0.010431
H  -7.086406 -1.265464 1.639048
H  -7.633011 -2.842696 1.068539
H  -6.302289 -2.690355 -1.778521
H  -6.153132 -4.089428 -0.737653
H  -4.702781 -3.283913 -1.334707
H  1.2217 -1.932609 2.608132
H  1.445603 -0.206405 2.909413
H  2.312822 1.274482 1.130935
H  2.209859 -2.97178 0.626666
H  3.788811 -2.776611 -1.264977
H  4.607071 -0.556886 -1.983517
H  1.526892 2.1618 -1.648233
H  4.988499 3.746449 0.301404
H  0.352548 4.301255 -1.30587
H  3.813475 5.900631 0.632817
H  1.487364 6.179081 -0.16215
totalener: -1117.84733182 hartree
nucrepener: 2216.19546868 hartree
electener: -3334.04280050 hartree
oneelecener: -5921.13739670 hartree
twoeener: 2587.09459620 hartree
kineticenergy: 1112.85926436 hartree
xcener: -110.231025443871 hartree
chargesum: 0.0000000
charge: -0.261981 -0.397727 -0.299715 0.081086 -0.030459 -0.099259 -0.243909 -0.266869 -0.188649 0.360930 -0.027328 -0.212531 -0.236805 0.045009 -0.019191 -0.170401 -0.140375 0.220493 -0.095199 -0.203366 0.222385 -0.150304 -0.192182 -0.115437 -0.101846 -0.135784 0.107488 0.079435 0.092897 0.082090 0.085508 0.102621 0.089765 0.082094 0.089683 0.083397 0.079260 0.086602 0.085055 0.096465 0.081738 0.108677 0.104490 0.115953 0.122504 0.124657 0.125168 0.131283 0.125878 0.125979 0.125168 0.125562
qa: -0.2620 -0.3977 -0.2997 0.0811 -0.0305 -0.0993 -0.2439 -0.2669 -0.1886 0.3609 -0.0273 -0.2125 -0.2368 0.0450 -0.0192 -0.1704 -0.1404 0.2205 -0.0952 -0.2034 0.2224 -0.1503 -0.1922 -0.1154 -0.1018 -0.1358 0.1075 0.0794 0.0929 0.0821 0.0855 0.1026 0.0898 0.0821 0.0897 0.0834 0.0793 0.0866 0.0851 0.0965 0.0817 0.1087 0.1045 0.1160 0.1225 0.1247 0.1252 0.1313 0.1259 0.1260 0.1252 0.1256
va: 2.1361 2.1047 2.1049 3.7321 3.8139 3.8702 3.9046 3.9053 3.8514 4.2395 3.7394 3.9404 3.9371 3.8716 3.7111 3.9376 3.9558 3.8475 3.9540 4.0253 3.8383 3.9599 4.0327 3.9436 3.9352 3.9544 1.0272 1.0343 1.0058 1.0073 1.0031 1.0216 1.0036 1.0023 1.0132 0.9990 1.0105 0.9979 1.0002 1.0023 1.0117 1.0100 0.9963 1.0167 1.0240 0.9994 1.0126 1.0037 1.0126 1.0002 0.9993 1.0003
dispcorr: -0.024391068 hartree
energy: -1117.871722888227
dipole: -34.64998 34.04096 -0.60903 -8.82722 9.41794 0.59071 -6.07573 6.02223 -0.05350
magnitude: 0.85013 au
magnitude: 2.16086 debye
