program: Orca
programVersion: 5.0.2
elementType: O O O C C C C C C C C C C C C C C C C C C C C C C C H H H H H H H H H H H H H H H H H H H H H H H H H H
charge: 0
multiplicity: 1
keywords: wb97x-d3
keywords: def2-TZVPP
keywords: def2/J RIJCOSX
keywords: DEFGRID2
keywords: scfconv7
keywords: smallprint printgap noloewdin
keywords: NOSOSCF
formula: C23H26O3
InChI: InChI=1/C23H26O3/c1-16(2)13-20-21(23(20,3)4)22(24)25-15-17-9-8-12-19(14-17)26-18-10-6-5-7-11-18/h5-14,20-21H,15H2,1-4H3
52 atoms
O  0.669547 -2.106853 -1.463141
O  0.131682 -2.947541 0.538446
O  2.671985 2.23984 0.383048
C  -2.811368 -2.569023 -0.460291
C  -2.412847 -1.406675 0.392433
C  -1.52767 -1.828506 -0.7748
C  -3.918637 -2.408989 -1.476347
C  -2.778538 -3.949426 0.150522
C  -3.109233 -0.107613 0.374778
C  -0.186955 -2.36858 -0.466061
C  -3.062211 0.832998 1.323288
C  -3.865732 2.093833 1.196254
C  -2.237109 0.75007 2.571916
C  2.046467 -2.366817 -1.204683
C  2.611894 -1.381598 -0.219117
C  2.384731 -0.023617 -0.415341
C  3.338699 -1.808481 0.881433
C  2.855176 0.896582 0.509696
C  3.84204 -0.877594 1.778579
C  3.594782 0.472716 1.607395
C  1.58549 2.750792 -0.264555
C  1.798681 3.877088 -1.047197
C  0.304977 2.227233 -0.121804
C  0.729279 4.48045 -1.69026
C  -0.752132 2.830762 -0.785486
C  -0.54909 3.957007 -1.569795
H  -2.001009 -1.699557 1.351775
H  -1.562924 -1.196924 -1.655207
H  -3.882944 -1.455874 -2.002491
H  -4.89627 -2.489098 -0.997788
H  -3.852545 -3.194599 -2.230626
H  -3.747747 -4.17108 0.600987
H  -2.020055 -4.054436 0.921421
H  -2.588643 -4.707595 -0.611649
H  -3.734024 0.092744 -0.490441
H  -4.428077 2.133106 0.263555
H  -3.225562 2.978479 1.24373
H  -4.580036 2.184355 2.018672
H  -2.870745 0.806614 3.460204
H  -1.551487 1.599431 2.62699
H  -1.639939 -0.155611 2.64638
H  2.531233 -2.266402 -2.176535
H  2.196009 -3.390989 -0.856784
H  1.824833 0.309322 -1.280429
H  3.494745 -2.866109 1.049262
H  4.410152 -1.208913 2.637596
H  3.96479 1.201863 2.315966
H  2.800248 4.275198 -1.143213
H  0.123766 1.352834 0.490481
H  0.90196 5.359953 -2.296365
H  -1.740903 2.404394 -0.68134
H  -1.380339 4.422323 -2.082019
totalener: -1117.84747808 hartree
nucrepener: 2339.54170503 hartree
electener: -3457.38918311 hartree
oneelecener: -6167.72239805 hartree
twoeener: 2710.33321494 hartree
kineticenergy: 1112.85537814 hartree
xcener: -110.235990227464 hartree
chargesum: 0.0000000
charge: -0.272997 -0.383477 -0.298282 0.089172 0.043844 -0.063337 -0.268985 -0.253977 -0.187529 0.322509 -0.087891 -0.225104 -0.259370 0.068679 0.041870 -0.275931 -0.157013 0.297447 -0.072273 -0.237413 0.295597 -0.229678 -0.221981 -0.072963 -0.092078 -0.176864 0.095410 0.076138 0.073447 0.098898 0.091304 0.084663 0.101123 0.083111 0.082075 0.082669 0.087443 0.097043 0.098588 0.086706 0.094849 0.108933 0.098654 0.131075 0.104015 0.123560 0.123221 0.123043 0.147021 0.124018 0.139622 0.121395
qa: -0.2730 -0.3835 -0.2983 0.0892 0.0438 -0.0633 -0.2690 -0.2540 -0.1875 0.3225 -0.0879 -0.2251 -0.2594 0.0687 0.0419 -0.2759 -0.1570 0.2974 -0.0723 -0.2374 0.2956 -0.2297 -0.2220 -0.0730 -0.0921 -0.1769 0.0954 0.0761 0.0734 0.0989 0.0913 0.0847 0.1011 0.0831 0.0821 0.0827 0.0874 0.0970 0.0986 0.0867 0.0948 0.1089 0.0987 0.1311 0.1040 0.1236 0.1232 0.1230 0.1470 0.1240 0.1396 0.1214
va: 2.1133 2.1192 2.1254 3.8118 3.7560 3.7970 3.9157 3.9043 3.8514 4.2435 3.7806 3.9203 3.9328 3.8672 3.6945 3.9486 4.0155 3.7820 3.9308 4.0518 3.8060 4.0509 3.9519 3.9180 3.8665 4.0223 1.0264 1.0362 1.0088 1.0012 1.0049 1.0004 1.0235 1.0030 1.0190 1.0083 0.9981 1.0017 1.0018 0.9983 1.0132 0.9897 1.0109 1.0175 1.0146 0.9991 1.0143 1.0151 0.9856 0.9983 0.9983 1.0039
dispcorr: -0.027535261 hartree
energy: -1117.875013339930
dipole: -25.87674 25.38018 -0.49655 -3.55553 3.71690 0.16138 3.06257 -3.45810 -0.39554
magnitude: 0.65502 au
magnitude: 1.66494 debye
