program: Orca
programVersion: 5.0.2
elementType: O O O C C C C C C C C C C C C C C C C C C C C C C C H H H H H H H H H H H H H H H H H H H H H H H H H H
charge: 0
multiplicity: 1
keywords: wb97x-d3
keywords: def2-TZVPP
keywords: def2/J RIJCOSX
keywords: DEFGRID2
keywords: scfconv7
keywords: smallprint printgap noloewdin
keywords: NOSOSCF
formula: C23H26O3
InChI: InChI=1/C23H26O3/c1-16(2)13-20-21(23(20,3)4)22(24)25-15-17-9-8-12-19(14-17)26-18-10-6-5-7-11-18/h5-14,20-21H,15H2,1-4H3
52 atoms
O  -0.915918 -0.627031 1.649881
O  -0.857003 -2.625737 0.643554
O  2.577448 2.869131 -0.453872
C  -3.388558 -1.435993 -0.805876
C  -3.787034 -2.457873 0.21719
C  -2.867539 -1.331163 0.61777
C  -4.39536 -0.389147 -1.216294
C  -2.474374 -1.85384 -1.93122
C  -5.153555 -2.528009 0.783819
C  -1.456959 -1.627652 0.948588
C  -6.043635 -3.493057 0.545217
C  -7.395199 -3.483508 1.193958
C  -5.790747 -4.652366 -0.36975
C  0.462901 -0.7401 2.00635
C  1.361827 -0.28185 0.892714
C  1.598402 1.078376 0.721754
C  1.956727 -1.191438 0.026966
C  2.414597 1.521625 -0.30499
C  2.772839 -0.738483 -0.999719
C  3.004531 0.614925 -1.177243
C  3.83285 3.386468 -0.578929
C  3.959026 4.552526 -1.322402
C  4.944237 2.822033 0.036356
C  5.201161 5.152596 -1.450857
C  6.181886 3.430241 -0.10853
C  6.319962 4.592872 -0.8514
H  -3.277232 -3.410225 0.110781
H  -3.304254 -0.5281 1.202009
H  -3.891267 0.493788 -1.612498
H  -5.030019 -0.067861 -0.391467
H  -5.051196 -0.778078 -1.997331
H  -1.887342 -1.007367 -2.292368
H  -3.071264 -2.221275 -2.768246
H  -1.782422 -2.641803 -1.645261
H  -5.44327 -1.726203 1.457182
H  -8.190643 -3.450477 0.445667
H  -7.525137 -2.631332 1.859728
H  -7.556296 -4.392473 1.778726
H  -5.85164 -5.598964 0.173015
H  -4.821557 -4.609621 -0.861512
H  -6.5530 -4.694746 -1.15173
H  0.70164 -1.761411 2.306988
H  0.57722 -0.094689 2.87722
H  1.148776 1.804225 1.388905
H  1.772218 -2.249902 0.147639
H  3.228983 -1.448415 -1.676891
H  3.637395 0.963972 -1.983162
H  3.083082 4.982082 -1.790469
H  4.850498 1.919447 0.625907
H  5.29377 6.061464 -2.030648
H  7.045509 2.988302 0.370796
H  7.289168 5.060314 -0.958987
totalener: -1117.84804251 hartree
nucrepener: 2146.54548601 hartree
electener: -3264.39352851 hartree
oneelecener: -5781.86768612 hartree
twoeener: 2517.47415761 hartree
kineticenergy: 1112.85783463 hartree
xcener: -110.231158808817 hartree
chargesum: -0.0000000
charge: -0.262422 -0.401444 -0.300337 0.131461 0.003280 -0.137994 -0.232288 -0.273876 -0.196411 0.371744 -0.027334 -0.210959 -0.238329 0.048547 -0.005781 -0.205472 -0.120050 0.191694 -0.119185 -0.149534 0.239918 -0.208390 -0.150489 -0.093217 -0.126671 -0.145430 0.095872 0.072813 0.092920 0.073210 0.087269 0.090109 0.083727 0.098648 0.081406 0.084077 0.077784 0.085140 0.089222 0.082425 0.083288 0.109587 0.104309 0.110998 0.126681 0.128200 0.134058 0.123499 0.130432 0.124002 0.125009 0.124286
qa: -0.2624 -0.4014 -0.3003 0.1315 0.0033 -0.1380 -0.2323 -0.2739 -0.1964 0.3717 -0.0273 -0.2110 -0.2383 0.0485 -0.0058 -0.2055 -0.1201 0.1917 -0.1192 -0.1495 0.2399 -0.2084 -0.1505 -0.0932 -0.1267 -0.1454 0.0959 0.0728 0.0929 0.0732 0.0873 0.0901 0.0837 0.0986 0.0814 0.0841 0.0778 0.0851 0.0892 0.0824 0.0833 0.1096 0.1043 0.1110 0.1267 0.1282 0.1341 0.1235 0.1304 0.1240 0.1250 0.1243
va: 2.1360 2.1012 2.1001 3.7190 3.7707 3.9442 3.9039 3.9125 3.8938 4.2135 3.7639 3.9399 3.9497 3.8617 3.6733 4.0845 3.9422 3.8833 3.9523 3.9607 3.8147 4.0256 3.9129 3.9420 3.9613 3.9583 1.0300 1.0397 1.0047 1.0094 1.0060 1.0025 1.0018 1.0219 1.0172 0.9985 1.0115 0.9977 0.9995 1.0119 0.9999 1.0098 0.9956 1.0236 1.0237 1.0006 1.0017 1.0145 1.0058 0.9988 1.0005 1.0005
dispcorr: -0.023076652 hartree
energy: -1117.871119159785
dipole: -31.97538 31.86185 -0.11354 -16.89503 17.01747 0.12244 -4.97487 4.90445 -0.07042
magnitude: 0.18122 au
magnitude: 0.46063 debye
