program: Orca
programVersion: 5.0.2
elementType: O O O C C C C C C C C C C C C C C C C C C C C C C C H H H H H H H H H H H H H H H H H H H H H H H H H H
charge: 0
multiplicity: 1
keywords: wb97x-d3
keywords: def2-TZVPP
keywords: def2/J RIJCOSX
keywords: DEFGRID2
keywords: scfconv7
keywords: smallprint printgap noloewdin
keywords: NOSOSCF
formula: C23H26O3
InChI: InChI=1/C23H26O3/c1-16(2)13-20-21(23(20,3)4)22(24)25-15-17-9-8-12-19(14-17)26-18-10-6-5-7-11-18/h5-14,20-21H,15H2,1-4H3
52 atoms
O  0.693564 -2.08923 -1.502882
O  0.098453 -2.968161 0.465484
O  2.670118 2.203724 0.468823
C  -2.813106 -2.508925 -0.588867
C  -2.414638 -1.383141 0.311798
C  -1.510742 -1.780976 -0.849485
C  -3.893486 -2.296923 -1.624054
C  -2.815212 -3.909509 -0.025039
C  -3.088324 -0.072363 0.322572
C  -0.187828 -2.35651 -0.529231
C  -3.062423 0.827924 1.310296
C  -3.836947 2.108595 1.204467
C  -2.290801 0.677978 2.586473
C  2.06094 -2.369093 -1.216164
C  2.608564 -1.405574 -0.199642
C  2.391654 -0.043225 -0.375835
C  3.30512 -1.85637 0.910844
C  2.842933 0.857506 0.577226
C  3.788718 -0.944624 1.838005
C  3.551689 0.409828 1.68576
C  1.595677 2.731806 -0.185325
C  0.310628 2.212449 -0.071414
C  1.826125 3.871589 -0.94342
C  -0.733606 2.83543 -0.737586
C  0.769183 4.493847 -1.589021
C  -0.51372 3.975781 -1.496361
H  -2.029044 -1.71514 1.26918
H  -1.514248 -1.119742 -1.708581
H  -3.832043 -1.326873 -2.115935
H  -4.8834 -2.378836 -1.171711
H  -3.820027 -3.056759 -2.403671
H  -2.610292 -4.64367 -0.806659
H  -3.800533 -4.134254 0.387452
H  -2.082608 -4.050147 0.764991
H  -3.674808 0.174922 -0.557313
H  -4.573328 2.18582 2.008563
H  -4.370675 2.191716 0.257878
H  -3.180643 2.977341 1.300916
H  -1.597423 1.513971 2.708555
H  -1.708763 -0.238639 2.645144
H  -2.960526 0.703878 3.449471
H  2.570824 -2.256757 -2.1738
H  2.191797 -3.40052 -0.882389
H  1.854397 0.308593 -1.247817
H  3.452266 -2.917654 1.062788
H  4.332552 -1.294588 2.705315
H  3.906071 1.123905 2.417288
H  0.115227 1.327432 0.52103
H  2.831091 4.265855 -1.017549
H  -1.725976 2.413082 -0.655036
H  0.955354 5.384029 -2.175278
H  -1.335475 4.456307 -2.009909
totalener: -1117.84742270 hartree
nucrepener: 2341.83033744 hartree
electener: -3459.67776014 hartree
oneelecener: -6172.30053913 hartree
twoeener: 2712.62277899 hartree
kineticenergy: 1112.85817291 hartree
xcener: -110.236606178639 hartree
chargesum: -0.0000000
charge: -0.272961 -0.383054 -0.298473 0.087477 0.048618 -0.063108 -0.268536 -0.254204 -0.197654 0.321038 -0.079535 -0.227547 -0.257803 0.068980 0.040850 -0.272618 -0.156903 0.294663 -0.072573 -0.236599 0.293339 -0.214693 -0.229217 -0.094320 -0.073989 -0.175668 0.095049 0.076170 0.073430 0.098799 0.091544 0.083436 0.084656 0.101140 0.082346 0.096880 0.082671 0.088649 0.086858 0.093990 0.098420 0.108807 0.098753 0.130953 0.104167 0.123528 0.123195 0.144899 0.123112 0.137756 0.123965 0.121315
qa: -0.2730 -0.3831 -0.2985 0.0875 0.0486 -0.0631 -0.2685 -0.2542 -0.1977 0.3210 -0.0795 -0.2275 -0.2578 0.0690 0.0409 -0.2726 -0.1569 0.2947 -0.0726 -0.2366 0.2933 -0.2147 -0.2292 -0.0943 -0.0740 -0.1757 0.0950 0.0762 0.0734 0.0988 0.0915 0.0834 0.0847 0.1011 0.0823 0.0969 0.0827 0.0886 0.0869 0.0940 0.0984 0.1088 0.0988 0.1310 0.1042 0.1235 0.1232 0.1449 0.1231 0.1378 0.1240 0.1213
va: 2.1125 2.1195 2.1248 3.8136 3.7507 3.7938 3.9153 3.9052 3.8560 4.2460 3.7723 3.9216 3.9324 3.8669 3.6948 3.9481 4.0154 3.7840 3.9305 4.0518 3.8061 3.9462 4.0499 3.8652 3.9201 4.0227 1.0267 1.0363 1.0090 1.0013 1.0048 1.0029 1.0005 1.0233 1.0188 1.0020 1.0083 0.9978 0.9985 1.0137 1.0013 0.9898 1.0110 1.0176 1.0145 0.9991 1.0142 0.9872 1.0151 1.0001 0.9983 1.0038
dispcorr: -0.027620581 hartree
energy: -1117.875043284934
dipole: -25.90280 25.41612 -0.48668 -3.31541 3.49101 0.17559 2.59425 -2.98242 -0.38817
magnitude: 0.64682 au
magnitude: 1.64408 debye
