program: Gaussian 09
title: 000071899
version: EM64L-G09RevD.01
frameworkgroup: C1[X(C13H18N2O)]
method: RPBEPBE
basis: SDD
operation: Freq
keyword: #p
keyword: freq=noraman
keyword: PBEPBE/SDD
title: #p freq=noraman PBEPBE/SDD
converged: YES YES NO NO
title: Mulliken charges:
elementType: O N N C C C C C C C C C C C C C H H H H H H H H H H H H H H H H H H
charge: -0.307143 -0.424780 -0.117213 -0.218910 0.379744 0.188012 -0.380605 0.187691 -0.478061 -0.347398 -0.693116 -0.696367 -0.380469 -0.350511 -0.268029 -0.250268 0.234398 0.220384 0.227362 0.226761 0.231157 0.245827 0.229231 0.208436 0.210433 0.230386 0.225339 0.210935 0.210856 0.313231 0.231082 0.250109 0.225254 0.226242
chargesum: 0.00000
title: Mulliken charges with hydrogens summed into heavy atoms:
elementType: O N N C C C C C C C C C C C C C
charge: -0.307143 -0.111549 -0.117213 0.015488 0.379744 0.188012 0.067140 0.187691 -0.020143 0.127659 -0.043860 -0.049237 -0.149387 -0.100402 -0.042775 -0.024026
polarizability: 2.00101462e+02 5.27402963e+00 1.68428820e+02 5.92940599e+00 -2.71150205e+00 9.90442447e+01
1716.lowfreq: -0.0006 0.0005 0.0005 5.4072 7.7243 10.9227 23.3958 38.9131 40.4406
frequency: 23.0942 38.6235 40.4373 59.6199 109.0773 114.9441 138.7716 162.4275 198.8741 203.7034 222.7383 241.0887 268.2057 275.7917 332.1840 342.9646 423.8497 484.7350 493.3029 506.6686 550.3805 562.5173 581.3075 599.0054 695.3300 719.0717 743.8427 748.2574 756.3884 805.6266 832.0015 852.7726 889.8592 898.4095 918.9529 931.7445 935.6140 953.8357 965.3664 974.4359 988.1330 1016.8897 1035.7287 1045.6482 1073.0733 1080.0968 1082.8370 1115.1916 1160.0276 1164.5016 1175.7245 1189.9508 1198.0151 1208.5012 1226.7119 1251.3721 1277.0191 1283.3464 1307.0521 1321.0601 1323.4349 1360.5548 1376.4094 1391.0961 1397.6311 1438.1203 1450.8894 1462.6837 1466.0101 1468.4261 1468.6307 1478.7429 1481.1753 1492.0384 1503.6187 1594.9178 1606.0943 1609.2869 2965.9133 2966.5998 2972.8229 2975.4338 2998.7574 3025.8393 3042.5285 3055.9500 3064.8584 3068.4692 3073.6294 3076.0810 3082.2741 3122.1291 3135.2751 3155.2790 3169.9082 3587.2377
redmass: 2.6687 3.7772 4.4809 3.9727 3.4963 3.4312 2.2136 3.3987 4.2653 1.4137 2.0005 1.1789 2.7233 2.5491 3.5705 3.4966 3.0807 3.0151 1.2485 4.4653 3.4833 3.5645 4.3587 4.0281 3.9739 3.4947 3.8957 3.1920 1.3430 5.5899 1.5056 1.4556 2.5969 4.3703 1.1878 3.6736 1.4642 1.4351 4.3320 1.3274 3.3275 2.2612 2.1070 2.9122 1.5589 1.6981 2.6734 2.6949 1.7618 1.1367 1.0869 1.8323 1.1265 1.1428 2.5632 1.3557 1.5165 1.6733 1.4127 1.3180 1.6396 1.4311 1.1941 2.2649 1.5744 2.2177 2.3443 1.2035 1.0443 1.0519 1.1150 1.0570 1.3529 1.4640 1.1920 6.8503 6.3819 7.1402 1.0641 1.0628 1.0348 1.0353 1.0665 1.0850 1.0961 1.0998 1.0999 1.1035 1.0988 1.1000 1.0991 1.0863 1.0889 1.0941 1.0984 1.0792
irintensity: 0.0443 3.2435 0.6374 0.9075 1.0880 3.7269 1.3366 8.4346 0.6589 0.2377 0.7454 0.3567 15.7910 0.3121 3.9798 2.8276 3.2738 19.4171 122.0604 9.1467 1.6773 2.1464 4.1498 1.7352 2.1410 2.4973 6.5774 3.4733 94.7890 16.4858 5.0052 0.1631 0.9960 3.2083 2.5085 23.5907 4.6701 0.1257 42.9853 0.5433 30.7487 9.5248 26.9340 2.4769 15.8495 1.0748 46.5187 2.3957 12.4385 3.5217 10.7609 60.2940 5.3420 5.2539 159.8990 35.1643 72.8697 17.6357 3.2837 2.2479 15.3319 10.9105 16.4232 3.1760 22.2584 43.2179 72.9221 35.8024 1.8943 4.1528 3.1066 11.6290 8.9918 56.9080 22.3641 5.2597 72.3222 69.8836 29.4399 66.0602 32.7328 38.3218 56.5477 1.1705 40.2762 14.5449 0.0160 44.1747 88.3373 31.9987 43.3975 8.3823 11.9967 35.8894 13.6861 37.4597
temp: 298.150 k
press: 1.00000 atm
elementType: 8 7 7 6 6 6 6 6 6 6 6 6 6 6 6 6 1 1 1 1 1 1 1 1 1 1 1 1 1 1 1 1 1 1
symmnumber: 1
zpe: 751885.6 jmol-1
zpe.correction: 0.286378 hartree
zpe.thermalcorrener: 0.302446 hartree
zpe.thermalcorrenthalpy: 0.303391 hartree
zpe.thermalcorrgfe: 0.241171 hartree
zpe.sumelectzpe: -689.679092 hartree
zpe.sumelectthermal: -689.663024 hartree
zpe.sumelectthermalent: -689.662079 hartree
zpe.sumelectthermalfe: -689.724299 hartree
dipole: -0.4729 1.9560 -1.2201
dipole: 2.3533
quadrupole: -91.4771 -90.2629 -101.0136
quadrupole: 9.7227 -3.9585 1.9060
quadrupole: 2.7741 3.9883 -6.7624 9.7227 -3.9585 1.9060
hfenergy: -689.9654699 hartree
pointgroup: C01 [X(C13H18N2O1)]
dipole: -0.0803998 0.7930478 -0.4710042 debye
polarizability: 200.6682732|1.1869782|167.6975765|7.4679314|-2.482287|99.2086775 unknown
InChI: InChI=1S/C13H18N2O/c1-10(2)11-5-3-4-6-12(11)16-9-13-14-7-8-15-13/h3-6,10,14H,7-9H2,1-2H3
charge 0 multiplicity 1
34 atoms
O  0.343894 -0.223712 -0.003745
N  2.955926 0.431135 -0.626502
N  3.691758 -1.425811 0.535081
C  -1.366046 2.048291 0.04803
C  -1.908199 0.620993 -0.077246
C  -1.038088 -0.508135 -0.098309
C  4.361665 0.797215 -0.326515
C  2.674729 -0.789059 -0.009968
C  4.898902 -0.561065 0.267727
C  1.282249 -1.358118 -0.063089
C  -1.882943 2.737521 1.339357
C  -1.710099 2.895469 -1.206661
C  -3.297759 0.373528 -0.175079
C  -1.54473 -1.82667 -0.204844
C  -3.821055 -0.934697 -0.286687
C  -2.938488 -2.035386 -0.299185
H  -0.266018 1.982322 0.123332
H  4.413843 1.622524 0.412483
H  4.905999 1.104615 -1.236435
H  5.557374 -1.082855 -0.452307
H  5.46814 -0.417662 1.201818
H  1.141436 -2.045754 0.790078
H  1.129721 -1.915572 -1.010455
H  -2.984064 2.840579 1.325962
H  -1.450478 3.751022 1.435886
H  -1.608329 2.156333 2.237784
H  -1.320659 2.424314 -2.127297
H  -1.2726 3.908037 -1.121978
H  -2.803909 3.010413 -1.324086
H  2.220649 1.10662 -0.83252
H  -3.986888 1.226401 -0.162958
H  -0.873419 -2.690071 -0.209925
H  -4.90238 -1.091271 -0.360016
H  -3.326231 -3.056795 -0.380532
