program: Orca
programVersion: 5.0.2
elementType: O O O C C C C C C C C C C C C C C C C C C C C C C C H H H H H H H H H H H H H H H H H H H H H H H H H H
charge: 0
multiplicity: 1
keywords: wb97x-d3
keywords: def2-TZVPP
keywords: def2/J RIJCOSX
keywords: DEFGRID2
keywords: scfconv7
keywords: smallprint printgap noloewdin
keywords: NOSOSCF
formula: C23H26O3
InChI: InChI=1/C23H26O3/c1-16(2)13-20-21(23(20,3)4)22(24)25-15-17-9-8-12-19(14-17)26-18-10-6-5-7-11-18/h5-14,20-21H,15H2,1-4H3
52 atoms
O  0.233774 -2.490739 -1.150267
O  -0.260276 -3.135261 0.935282
O  2.91249 2.075219 -1.017922
C  -3.110312 -3.522929 -0.368642
C  -3.072091 -2.312707 0.500944
C  -2.008579 -2.493494 -0.5631
C  -4.126043 -3.594189 -1.483629
C  -2.80302 -4.868827 0.241648
C  -4.066823 -1.215614 0.390532
C  -0.614119 -2.749281 -0.148835
C  -3.824266 0.067173 0.664135
C  -4.900097 1.104438 0.553907
C  -2.484486 0.578497 1.099207
C  1.62992 -2.598463 -0.868608
C  2.142445 -1.371812 -0.168525
C  2.279045 -0.185887 -0.883169
C  2.451215 -1.393297 1.184892
C  2.738081 0.958016 -0.25314
C  2.911964 -0.242612 1.808416
C  3.062378 0.936296 1.098503
C  2.467724 3.281375 -0.56431
C  3.212855 4.399762 -0.912662
C  1.296459 3.418231 0.171749
C  2.782131 5.658124 -0.52393
C  0.883511 4.683088 0.561264
C  1.620172 5.807443 0.218727
H  -2.703416 -2.501741 1.506282
H  -2.108185 -1.881562 -1.452261
H  -3.781982 -4.267881 -2.270068
H  -4.31402 -2.622779 -1.940895
H  -5.079367 -3.977833 -1.114193
H  -3.721789 -5.315205 0.626102
H  -2.095615 -4.806599 1.064529
H  -2.393398 -5.551881 -0.504757
H  -5.073416 -1.495163 0.092675
H  -5.06966 1.59925 1.51329
H  -5.847315 0.678812 0.225045
H  -4.618649 1.887525 -0.154522
H  -1.736566 -0.205148 1.198828
H  -2.562559 1.089102 2.062232
H  -2.10408 1.316481 0.387362
H  2.100991 -2.707664 -1.845508
H  1.841126 -3.497481 -0.287451
H  2.036637 -0.146243 -1.938504
H  2.321675 -2.304987 1.752021
H  3.16044 -0.264165 2.861102
H  3.431225 1.828606 1.587806
H  4.120675 4.276195 -1.488533
H  0.707967 2.548886 0.436431
H  3.366127 6.526753 -0.798325
H  -0.028766 4.786851 1.133992
H  1.290184 6.79074 0.525019
totalener: -1117.84740351 hartree
nucrepener: 2235.27497323 hartree
electener: -3353.12237675 hartree
oneelecener: -5959.25304022 hartree
twoeener: 2606.13066347 hartree
kineticenergy: 1112.85887737 hartree
xcener: -110.231233909959 hartree
chargesum: 0.0000000
charge: -0.262149 -0.399402 -0.299941 0.129802 -0.032743 -0.091631 -0.277975 -0.257507 -0.234882 0.344127 0.008019 -0.211360 -0.236949 0.053478 -0.004312 -0.226814 -0.110711 0.209187 -0.118428 -0.152626 0.230176 -0.203133 -0.147933 -0.096409 -0.131743 -0.139795 0.104623 0.082439 0.091290 0.084306 0.091146 0.083497 0.100130 0.085607 0.093273 0.085966 0.078510 0.084980 0.083947 0.089025 0.082583 0.110807 0.104521 0.112231 0.118916 0.127261 0.132509 0.124510 0.136621 0.124704 0.124458 0.123795
qa: -0.2621 -0.3994 -0.2999 0.1298 -0.0327 -0.0916 -0.2780 -0.2575 -0.2349 0.3441 0.0080 -0.2114 -0.2369 0.0535 -0.0043 -0.2268 -0.1107 0.2092 -0.1184 -0.1526 0.2302 -0.2031 -0.1479 -0.0964 -0.1317 -0.1398 0.1046 0.0824 0.0913 0.0843 0.0911 0.0835 0.1001 0.0856 0.0933 0.0860 0.0785 0.0850 0.0839 0.0890 0.0826 0.1108 0.1045 0.1122 0.1189 0.1273 0.1325 0.1245 0.1366 0.1247 0.1245 0.1238
va: 2.1269 2.0970 2.1010 3.7407 3.8352 3.7981 3.9133 3.8975 3.9033 4.2050 3.7326 3.9402 3.9492 3.8537 3.6756 4.0744 3.9521 3.8665 3.9601 3.9534 3.8273 4.0246 3.9185 3.9427 3.9658 3.9580 1.0272 1.0334 1.0066 1.0045 1.0007 1.0025 1.0209 1.0019 1.0094 0.9986 1.0100 0.9990 1.0173 1.0010 1.0005 0.9942 1.0117 1.0256 1.0228 1.0007 1.0026 1.0143 0.9968 0.9988 1.0010 1.0005
dispcorr: -0.024461342 hartree
energy: -1117.871864854923
dipole: -26.94269 26.62446 -0.31823 -6.86046 7.18498 0.32452 2.64493 -2.76337 -0.11844
magnitude: 0.46970 au
magnitude: 1.19387 debye
