program: Orca
programVersion: 5.0.2
elementType: O O O C C C C C C C C C C C C C C C C C C C C C C C H H H H H H H H H H H H H H H H H H H H H H H H H H
charge: 0
multiplicity: 1
keywords: wb97x-d3
keywords: def2-TZVPP
keywords: def2/J RIJCOSX
keywords: DEFGRID2
keywords: scfconv7
keywords: smallprint printgap noloewdin
keywords: NOSOSCF
formula: C23H26O3
InChI: InChI=1/C23H26O3/c1-16(2)13-20-21(23(20,3)4)22(24)25-15-17-9-8-12-19(14-17)26-18-10-6-5-7-11-18/h5-14,20-21H,15H2,1-4H3
52 atoms
O  0.696391 -2.100969 -1.501575
O  0.066819 -3.028534 0.433436
O  2.638419 2.214864 0.44438
C  -2.828934 -2.47913 -0.636989
C  -2.410225 -1.409497 0.318814
C  -1.507896 -1.771544 -0.856084
C  -3.894733 -2.189749 -1.668324
C  -2.8664 -3.905384 -0.143199
C  -3.052569 -0.084549 0.402524
C  -0.199491 -2.383298 -0.545792
C  -2.893038 0.805779 1.386827
C  -3.655413 2.097618 1.388763
C  -1.974368 0.624572 2.557162
C  2.060751 -2.374663 -1.192716
C  2.575924 -1.403526 -0.16673
C  2.382465 -0.042042 -0.374287
C  3.206974 -1.843305 0.98671
C  2.792404 0.869217 0.587069
C  3.6510 -0.921753 1.923922
C  3.436385 0.432569 1.738373
C  1.569477 2.739019 -0.221633
C  0.287503 2.206757 -0.136696
C  1.802266 3.889467 -0.963045
C  -0.75159 2.829048 -0.811965
C  0.750625 4.50948 -1.619062
C  -0.529451 3.98001 -1.553539
H  -2.036024 -1.799369 1.258916
H  -1.490305 -1.07141 -1.683563
H  -4.890801 -2.283243 -1.231798
H  -3.824275 -2.902549 -2.491367
H  -3.813121 -1.192656 -2.099947
H  -2.684716 -4.60473 -0.961602
H  -3.85503 -4.124663 0.264331
H  -2.133523 -4.103383 0.634229
H  -3.736576 0.176544 -0.399509
H  -2.978879 2.955743 1.405145
H  -4.282089 2.178887 2.280644
H  -4.304014 2.194797 0.518421
H  -2.538225 0.593462 3.492865
H  -1.292567 1.474811 2.636582
H  -1.365906 -0.275408 2.502716
H  2.586808 -2.25827 -2.140936
H  2.192436 -3.404783 -0.855917
H  1.894129 0.301605 -1.277938
H  3.333505 -2.903491 1.162562
H  4.144089 -1.263364 2.824246
H  3.758781 1.154749 2.476705
H  0.090251 1.312189 0.440174
H  2.804612 4.293695 -1.015676
H  -1.742005 2.398279 -0.749146
H  0.938728 5.407724 -2.192266
H  -1.346776 4.460051 -2.07447
totalener: -1117.84710545 hartree
nucrepener: 2350.62840186 hartree
electener: -3468.47550730 hartree
oneelecener: -6189.88729093 hartree
twoeener: 2721.41178363 hartree
kineticenergy: 1112.86220822 hartree
xcener: -110.237216552835 hartree
chargesum: -0.0000000
charge: -0.272409 -0.385393 -0.299041 0.095051 0.032164 -0.052220 -0.272974 -0.252981 -0.188736 0.316406 -0.080438 -0.228630 -0.267242 0.068202 0.032345 -0.267160 -0.150393 0.289931 -0.074439 -0.233021 0.289812 -0.196156 -0.226866 -0.116335 -0.077921 -0.168586 0.095886 0.077168 0.099393 0.092332 0.072736 0.083367 0.084669 0.100961 0.084514 0.089131 0.096470 0.082736 0.102060 0.088060 0.094671 0.109377 0.099154 0.130191 0.105589 0.123834 0.123621 0.143614 0.123139 0.138539 0.124004 0.121812
qa: -0.2724 -0.3854 -0.2990 0.0951 0.0322 -0.0522 -0.2730 -0.2530 -0.1887 0.3164 -0.0804 -0.2286 -0.2672 0.0682 0.0323 -0.2672 -0.1504 0.2899 -0.0744 -0.2330 0.2898 -0.1962 -0.2269 -0.1163 -0.0779 -0.1686 0.0959 0.0772 0.0994 0.0923 0.0727 0.0834 0.0847 0.1010 0.0845 0.0891 0.0965 0.0827 0.1021 0.0881 0.0947 0.1094 0.0992 0.1302 0.1056 0.1238 0.1236 0.1436 0.1231 0.1385 0.1240 0.1218
va: 2.1127 2.1152 2.1247 3.8332 3.7504 3.7918 3.9158 3.8998 3.8458 4.2455 3.7540 3.9240 3.9316 3.8679 3.6951 3.9488 4.0091 3.7833 3.9298 4.0513 3.8107 3.9198 4.0433 3.8827 3.9263 4.0156 1.0265 1.0356 1.0009 1.0049 1.0075 1.0030 1.0008 1.0228 1.0175 0.9975 1.0017 1.0083 1.0016 0.9978 1.0129 0.9905 1.0115 1.0171 1.0149 0.9991 1.0139 0.9832 1.0151 1.0009 0.9982 1.0030
dispcorr: -0.028084581 hartree
energy: -1117.875190027087
dipole: -25.09014 24.64613 -0.44401 -3.13909 3.33965 0.20056 2.71516 -3.07028 -0.35513
magnitude: 0.60290 au
magnitude: 1.53244 debye
