program: Orca
programVersion: 5.0.2
elementType: O O O C C C C C C C C C C C C C C C C C C C C C C C H H H H H H H H H H H H H H H H H H H H H H H H H H
charge: 0
multiplicity: 1
keywords: wb97x-d3
keywords: def2-TZVPP
keywords: def2/J RIJCOSX
keywords: DEFGRID2
keywords: scfconv7
keywords: smallprint printgap noloewdin
keywords: NOSOSCF
formula: C23H26O3
InChI: InChI=1/C23H26O3/c1-16(2)13-20-21(23(20,3)4)22(24)25-15-17-9-8-12-19(14-17)26-18-10-6-5-7-11-18/h5-14,20-21H,15H2,1-4H3
52 atoms
O  0.682104 -2.132698 -1.460837
O  0.102696 -3.062076 0.489377
O  2.607546 2.265452 0.326791
C  -2.824502 -2.529007 -0.505414
C  -2.380549 -1.44678 0.423732
C  -1.510695 -1.824498 -0.771464
C  -3.92016 -2.252178 -1.508526
C  -2.846941 -3.948816 0.007232
C  -3.016836 -0.118244 0.505568
C  -0.190825 -2.423083 -0.486278
C  -2.796542 0.799518 1.452292
C  -3.551434 2.095424 1.460829
C  -1.811876 0.644286 2.572012
C  2.057846 -2.372329 -1.174006
C  2.567153 -1.369972 -0.175569
C  2.369731 -0.016053 -0.425286
C  3.189309 -1.772064 0.996387
C  2.76706 0.92537 0.511894
C  3.621474 -0.820952 1.909283
C  3.40266 0.526308 1.681243
C  1.531144 2.763593 -0.346904
C  1.748599 3.90484 -1.106956
C  0.256311 2.215783 -0.253425
C  0.689122 4.498954 -1.774098
C  -0.790856 2.812566 -0.93919
C  -0.583782 3.953373 -1.700571
H  -1.97989 -1.823066 1.358528
H  -1.517509 -1.133761 -1.606927
H  -4.902777 -2.334561 -1.04048
H  -3.877669 -2.978562 -2.321493
H  -3.847937 -1.262551 -1.958603
H  -2.087975 -4.138572 0.761344
H  -2.694148 -4.658162 -0.808384
H  -3.821282 -4.161515 0.450965
H  -3.746263 0.121885 -0.262263
H  -4.12095 2.209489 2.386762
H  -4.252083 2.169268 0.629413
H  -2.870577 2.948615 1.407144
H  -2.323232 0.618819 3.537713
H  -1.136788 1.502786 2.603907
H  -1.196916 -0.249718 2.494485
H  2.56347 -2.26135 -2.133832
H  2.218519 -3.392835 -0.821328
H  1.887752 0.298033 -1.3431
H  3.318293 -2.825932 1.205007
H  4.1086 -1.133219 2.823364
H  3.715952 1.271732 2.400115
H  2.745231 4.322106 -1.165492
H  0.070471 1.32869 0.338264
H  0.86545 5.389767 -2.362404
H  -1.775862 2.370478 -0.867897
H  -1.406716 4.413297 -2.230704
totalener: -1117.84699856 hartree
nucrepener: 2352.55195419 hartree
electener: -3470.39895275 hartree
oneelecener: -6193.72760435 hartree
twoeener: 2723.32865160 hartree
kineticenergy: 1112.86132234 hartree
xcener: -110.236722835987 hartree
chargesum: -0.0000000
charge: -0.272104 -0.386345 -0.299209 0.098927 0.025349 -0.049062 -0.273644 -0.253191 -0.185782 0.315412 -0.079674 -0.228368 -0.267897 0.067219 0.025602 -0.264725 -0.146090 0.289693 -0.075396 -0.231616 0.291073 -0.225472 -0.187029 -0.080123 -0.126212 -0.164175 0.096037 0.076965 0.099727 0.092150 0.072295 0.101369 0.083311 0.084563 0.084355 0.096335 0.082353 0.089039 0.103144 0.088379 0.094175 0.109903 0.099242 0.129965 0.106569 0.124145 0.123813 0.123154 0.139548 0.124050 0.135991 0.122260
qa: -0.2721 -0.3863 -0.2992 0.0989 0.0253 -0.0491 -0.2736 -0.2532 -0.1858 0.3154 -0.0797 -0.2284 -0.2679 0.0672 0.0256 -0.2647 -0.1461 0.2897 -0.0754 -0.2316 0.2911 -0.2255 -0.1870 -0.0801 -0.1262 -0.1642 0.0960 0.0770 0.0997 0.0921 0.0723 0.1014 0.0833 0.0846 0.0844 0.0963 0.0824 0.0890 0.1031 0.0884 0.0942 0.1099 0.0992 0.1300 0.1066 0.1241 0.1238 0.1232 0.1395 0.1241 0.1360 0.1223
va: 2.1127 2.1137 2.1249 3.8337 3.7542 3.7936 3.9154 3.8980 3.8454 4.2455 3.7496 3.9261 3.9307 3.8691 3.6977 3.9498 4.0041 3.7809 3.9295 4.0501 3.8062 4.0401 3.9072 3.9292 3.8973 4.0102 1.0264 1.0359 1.0007 1.0051 1.0072 1.0227 1.0030 1.0007 1.0173 1.0018 1.0084 0.9973 1.0012 0.9980 1.0129 0.9909 1.0116 1.0166 1.0154 0.9990 1.0137 1.0152 0.9848 0.9982 1.0010 1.0025
dispcorr: -0.028204536 hartree
energy: -1117.875203095779
dipole: -24.66008 24.22575 -0.43433 -3.27265 3.48496 0.21231 3.42933 -3.76600 -0.33667
magnitude: 0.58913 au
magnitude: 1.49744 debye
