program: Orca
programVersion: 5.0.2
elementType: O O O C C C C C C C C C C C C C C C C C C C C C C C H H H H H H H H H H H H H H H H H H H H H H H H H H
charge: 0
multiplicity: 1
keywords: wb97x-d3
keywords: def2-TZVPP
keywords: def2/J RIJCOSX
keywords: DEFGRID2
keywords: scfconv7
keywords: smallprint printgap noloewdin
keywords: NOSOSCF
formula: C23H26O3
InChI: InChI=1/C23H26O3/c1-16(2)13-20-21(23(20,3)4)22(24)25-15-17-9-8-12-19(14-17)26-18-10-6-5-7-11-18/h5-14,20-21H,15H2,1-4H3
52 atoms
O  0.01766 -1.822184 -1.722615
O  -0.923351 0.065361 -0.974701
O  3.086478 1.767237 1.399748
C  -2.433202 -1.999714 0.854677
C  -3.341667 -1.469542 -0.214345
C  -2.002453 -2.035219 -0.603356
C  -2.754948 -3.336854 1.47599
C  -1.794951 -1.032002 1.821204
C  -4.582363 -2.173839 -0.624398
C  -0.944411 -1.131011 -1.101376
C  -5.795135 -1.933416 -0.125033
C  -7.004417 -2.666039 -0.621143
C  -6.053673 -0.921901 0.94964
C  1.183487 -1.09872 -2.119492
C  2.096651 -0.868376 -0.948175
C  2.180832 0.385345 -0.357866
C  2.827399 -1.929973 -0.423423
C  3.004527 0.575537 0.745131
C  3.637183 -1.732986 0.682527
C  3.73535 -0.480875 1.268726
C  3.032977 2.941746 0.707885
C  3.737478 3.13903 -0.473704
C  2.290259 3.972817 1.264146
C  3.68642 4.376877 -1.095427
C  2.256955 5.208707 0.637258
C  2.9506 5.416536 -0.54538
H  -3.384026 -0.384975 -0.263955
H  -1.997291 -3.023258 -1.051929
H  -1.856383 -3.790511 1.897674
H  -3.182326 -4.038791 0.76105
H  -3.479441 -3.21683 2.283833
H  -1.629527 -0.047517 1.390897
H  -0.83239 -1.408293 2.173122
H  -2.439471 -0.911108 2.694313
H  -4.48682 -2.927786 -1.400693
H  -6.755956 -3.385229 -1.40061
H  -7.744241 -1.972621 -1.029163
H  -7.498425 -3.205748 0.190753
H  -6.570606 -1.381725 1.795546
H  -6.70625 -0.124144 0.585501
H  -5.142545 -0.463293 1.328941
H  0.913404 -0.157825 -2.601889
H  1.664708 -1.735588 -2.861847
H  1.584986 1.201721 -0.745491
H  2.759635 -2.910343 -0.878416
H  4.20748 -2.55733 1.089832
H  4.36911 -0.316625 2.130145
H  4.323619 2.336738 -0.903373
H  1.748069 3.8014 2.18465
H  4.235086 4.529429 -2.015549
H  1.678256 6.011071 1.075591
H  2.91905 6.380199 -1.035235
totalener: -1117.84720446 hartree
nucrepener: 2213.73602113 hartree
electener: -3331.58322559 hartree
oneelecener: -5916.46297096 hartree
twoeener: 2584.87974537 hartree
kineticenergy: 1112.86203986 hartree
xcener: -110.231609113805 hartree
chargesum: -0.0000000
charge: -0.264717 -0.395424 -0.300224 0.109631 -0.026764 -0.115453 -0.241112 -0.274269 -0.191116 0.364008 -0.026803 -0.211326 -0.234458 0.046885 -0.016486 -0.116072 -0.193731 0.218033 -0.085930 -0.215810 0.251082 -0.166653 -0.207357 -0.113218 -0.089436 -0.146121 0.105464 0.074978 0.093452 0.078902 0.086224 0.102402 0.092100 0.082854 0.087504 0.078019 0.085729 0.083557 0.083229 0.093964 0.080895 0.106957 0.110618 0.130253 0.110139 0.124377 0.125504 0.129180 0.123335 0.125357 0.123905 0.123944
qa: -0.2647 -0.3954 -0.3002 0.1096 -0.0268 -0.1155 -0.2411 -0.2743 -0.1911 0.3640 -0.0268 -0.2113 -0.2345 0.0469 -0.0165 -0.1161 -0.1937 0.2180 -0.0859 -0.2158 0.2511 -0.1667 -0.2074 -0.1132 -0.0894 -0.1461 0.1055 0.0750 0.0935 0.0789 0.0862 0.1024 0.0921 0.0829 0.0875 0.0780 0.0857 0.0836 0.0832 0.0940 0.0809 0.1070 0.1106 0.1303 0.1101 0.1244 0.1255 0.1292 0.1233 0.1254 0.1239 0.1239
va: 2.1334 2.1059 2.1090 3.7154 3.8042 3.9017 3.9019 3.9066 3.8621 4.2337 3.7375 3.9408 3.9420 3.8727 3.6873 3.8570 4.0209 3.8564 3.9322 4.0466 3.8156 3.9478 4.0447 3.9450 3.9338 3.9652 1.0261 1.0367 1.0052 1.0078 1.0047 1.0210 1.0025 1.0022 1.0143 1.0109 0.9977 0.9988 1.0004 1.0007 1.0111 1.0100 0.9930 1.0275 1.0128 0.9990 1.0127 1.0057 1.0146 1.0000 0.9991 1.0006
dispcorr: -0.024180927 hartree
energy: -1117.871385384392
dipole: -31.23038 31.06359 -0.16679 -12.91082 12.41620 -0.49462 5.14295 -5.25692 -0.11397
magnitude: 0.53428 au
magnitude: 1.35803 debye
