program: Orca
programVersion: 5.0.2
elementType: O O O C C C C C C C C C C C C C C C C C C C C C C C H H H H H H H H H H H H H H H H H H H H H H H H H H
charge: 0
multiplicity: 1
keywords: wb97x-d3
keywords: def2-TZVPP
keywords: def2/J RIJCOSX
keywords: DEFGRID2
keywords: scfconv7
keywords: smallprint printgap noloewdin
keywords: NOSOSCF
formula: C23H26O3
InChI: InChI=1/C23H26O3/c1-16(2)13-20-21(23(20,3)4)22(24)25-15-17-9-8-12-19(14-17)26-18-10-6-5-7-11-18/h5-14,20-21H,15H2,1-4H3
52 atoms
O  -0.523853 -0.929771 -1.020215
O  -0.589742 -2.790011 0.226746
O  3.034922 3.127015 0.456047
C  -3.612972 -2.742449 -0.590973
C  -3.442087 -2.231413 0.805679
C  -2.61252 -1.633644 -0.302616
C  -4.838554 -2.32494 -1.36687
C  -3.145693 -4.138527 -0.921098
C  -4.465613 -1.400267 1.490852
C  -1.153575 -1.874228 -0.315761
C  -5.557304 -1.882272 2.085558
C  -6.525679 -0.983994 2.792671
C  -5.900238 -3.340576 2.1109
C  0.900756 -0.995216 -1.119384
C  1.567534 -0.195081 -0.035734
C  2.005332 1.094278 -0.306682
C  1.740346 -0.722506 1.242325
C  2.619814 1.846574 0.686775
C  2.334925 0.043255 2.23115
C  2.784001 1.327673 1.960234
C  3.823894 3.392511 -0.623703
C  3.701836 4.650242 -1.199395
C  4.752011 2.48228 -1.116349
C  4.512151 4.995772 -2.269178
C  5.549876 2.839993 -2.19242
C  5.435936 4.092957 -2.775352
H  -2.876493 -2.895135 1.455166
H  -2.906861 -0.651306 -0.656521
H  -5.677632 -2.985648 -1.139594
H  -4.651742 -2.382472 -2.4405
H  -5.154674 -1.309349 -1.133056
H  -2.864898 -4.21927 -1.972969
H  -3.95908 -4.845816 -0.746294
H  -2.295877 -4.454773 -0.32221
H  -4.286623 -0.32946 1.525594
H  -6.611434 -1.252998 3.848342
H  -7.528057 -1.07342 2.366733
H  -6.22921 0.062639 2.738103
H  -5.930577 -3.712872 3.138061
H  -5.192345 -3.952446 1.555194
H  -6.894646 -3.512455 1.691662
H  1.13682 -0.576399 -2.097657
H  1.238186 -2.032251 -1.102564
H  1.87149 1.515597 -1.296353
H  1.406874 -1.727622 1.459824
H  2.46464 -0.367376 3.223638
H  3.259428 1.926604 2.725654
H  2.976767 5.348897 -0.802979
H  4.858152 1.504709 -0.664457
H  4.414474 5.977393 -2.713841
H  6.271764 2.128864 -2.572159
H  6.063118 4.36435 -3.61347
totalener: -1117.84732100 hartree
nucrepener: 2148.48743257 hartree
electener: -3266.33475357 hartree
oneelecener: -5785.68769157 hartree
twoeener: 2519.35293800 hartree
kineticenergy: 1112.85622898 hartree
xcener: -110.231026655227 hartree
chargesum: -0.0000000
charge: -0.262976 -0.411497 -0.301031 0.070454 -0.029361 -0.092310 -0.244805 -0.268423 -0.187253 0.369730 -0.026118 -0.210203 -0.241482 0.051736 0.005903 -0.180723 -0.146540 0.194998 -0.105222 -0.185047 0.237560 -0.208615 -0.149486 -0.092303 -0.125003 -0.147769 0.107263 0.080557 0.084604 0.095675 0.083208 0.088168 0.080316 0.106038 0.091394 0.085827 0.083523 0.079869 0.097465 0.082570 0.086668 0.098479 0.112930 0.116422 0.142924 0.126831 0.126375 0.124758 0.129755 0.124220 0.125878 0.124071
qa: -0.2630 -0.4115 -0.3010 0.0705 -0.0294 -0.0923 -0.2448 -0.2684 -0.1873 0.3697 -0.0261 -0.2102 -0.2415 0.0517 0.0059 -0.1807 -0.1465 0.1950 -0.1052 -0.1850 0.2376 -0.2086 -0.1495 -0.0923 -0.1250 -0.1478 0.1073 0.0806 0.0846 0.0957 0.0832 0.0882 0.0803 0.1060 0.0914 0.0858 0.0835 0.0799 0.0975 0.0826 0.0867 0.0985 0.1129 0.1164 0.1429 0.1268 0.1264 0.1248 0.1298 0.1242 0.1259 0.1241
va: 2.1404 2.0834 2.1021 3.7216 3.8174 3.8638 3.9103 3.9034 3.8543 4.2151 3.7372 3.9390 3.9368 3.8438 3.6986 3.9972 3.9449 3.8678 3.9525 4.0385 3.8199 4.0264 3.9099 3.9412 3.9581 3.9597 1.0272 1.0348 1.0025 1.0058 1.0073 1.0030 1.0024 1.0213 1.0131 0.9983 0.9990 1.0105 1.0029 1.0110 0.9995 1.0004 1.0140 1.0137 1.0193 1.0004 1.0110 1.0141 1.0063 0.9986 1.0001 1.0006
dispcorr: -0.023465145 hartree
energy: -1117.870786141096
dipole: -34.70948 34.29707 -0.41242 -18.15632 18.18267 0.02635 2.27401 -2.62202 -0.34800
magnitude: 0.54027 au
magnitude: 1.37325 debye
