program: Orca
programVersion: 5.0.2
elementType: O O O C C C C C C C C C C C C C C C C C C C C C C C H H H H H H H H H H H H H H H H H H H H H H H H H H
charge: 0
multiplicity: 1
keywords: wb97x-d3
keywords: def2-TZVPP
keywords: def2/J RIJCOSX
keywords: DEFGRID2
keywords: scfconv7
keywords: smallprint printgap noloewdin
keywords: NOSOSCF
formula: C23H26O3
InChI: InChI=1/C23H26O3/c1-16(2)13-20-21(23(20,3)4)22(24)25-15-17-9-8-12-19(14-17)26-18-10-6-5-7-11-18/h5-14,20-21H,15H2,1-4H3
52 atoms
O  0.44078 -2.115835 1.073963
O  -0.285831 -2.421102 -1.026771
O  3.265951 1.712903 -0.712505
C  -2.101954 0.02628 -0.158515
C  -2.903227 -1.237423 -0.253614
C  -1.634314 -1.233395 0.555803
C  -2.60106 1.136831 0.732539
C  -1.386201 0.528166 -1.387489
C  -4.210715 -1.398703 0.428199
C  -0.454822 -1.987018 0.080157
C  -5.400288 -1.247291 -0.155443
C  -6.675261 -1.458166 0.603266
C  -5.569359 -0.865228 -1.594372
C  1.680904 -2.732755 0.786342
C  2.750641 -1.75016 0.381607
C  2.461549 -0.433713 0.054777
C  4.066135 -2.19933 0.323684
C  3.486631 0.424831 -0.327156
C  5.077854 -1.33775 -0.064052
C  4.798491 -0.019974 -0.386415
C  2.209828 2.426708 -0.231141
C  1.491133 3.187182 -1.142405
C  1.889137 2.461374 1.121214
C  0.454842 3.993888 -0.6977
C  0.842206 3.261979 1.550224
C  0.121749 4.032017 0.64776
H  -2.806935 -1.753579 -1.204606
H  -1.739705 -1.204915 1.635351
H  -3.086411 0.765078 1.63415
H  -3.331177 1.749802 0.200403
H  -1.775126 1.78446 1.03128
H  -2.058646 1.16798 -1.96286
H  -1.050822 -0.272757 -2.04244
H  -0.519159 1.134577 -1.117857
H  -4.186585 -1.669669 1.479907
H  -7.294887 -0.55798 0.590212
H  -6.493971 -1.726026 1.643457
H  -7.273515 -2.253861 0.152186
H  -6.100609 -1.644959 -2.145971
H  -4.624273 -0.680882 -2.100972
H  -6.1731 0.041418 -1.682075
H  1.56628 -3.493779 0.010642
H  1.979641 -3.236968 1.706965
H  1.445474 -0.066094 0.094678
H  4.300692 -3.225363 0.581204
H  6.099496 -1.691261 -0.107677
H  5.583544 0.661328 -0.685827
H  1.753636 3.146967 -2.191356
H  2.453611 1.873987 1.833905
H  -0.099579 4.58837 -1.411733
H  0.594749 3.28918 2.603301
H  -0.690502 4.657672 0.992024
totalener: -1117.84678800 hartree
nucrepener: 2303.50018077 hartree
electener: -3421.34696876 hartree
oneelecener: -6095.58946168 hartree
twoeener: 2674.24249292 hartree
kineticenergy: 1112.84844599 hartree
xcener: -110.235551437584 hartree
chargesum: 0.0000000
charge: -0.272379 -0.367443 -0.295554 0.159881 -0.021362 -0.124357 -0.243265 -0.250805 -0.195991 0.303367 -0.026417 -0.213359 -0.234076 0.046761 0.040184 -0.172913 -0.216231 0.300315 -0.073566 -0.230471 0.249640 -0.190072 -0.167812 -0.089847 -0.109838 -0.169270 0.103092 0.074154 0.080563 0.086424 0.086159 0.087023 0.113127 0.036137 0.085540 0.083334 0.077820 0.086771 0.091533 0.080991 0.083516 0.114598 0.110777 0.088631 0.107312 0.123033 0.123075 0.124317 0.132526 0.124751 0.130313 0.129363
qa: -0.2724 -0.3674 -0.2956 0.1599 -0.0214 -0.1244 -0.2433 -0.2508 -0.1960 0.3034 -0.0264 -0.2134 -0.2341 0.0468 0.0402 -0.1729 -0.2162 0.3003 -0.0736 -0.2305 0.2496 -0.1901 -0.1678 -0.0898 -0.1098 -0.1693 0.1031 0.0742 0.0806 0.0864 0.0862 0.0870 0.1131 0.0361 0.0855 0.0833 0.0778 0.0868 0.0915 0.0810 0.0835 0.1146 0.1108 0.0886 0.1073 0.1230 0.1231 0.1243 0.1325 0.1248 0.1303 0.1294
va: 2.1250 2.1305 2.1240 3.6555 3.8056 3.9263 3.9011 3.8850 3.8809 4.2717 3.7422 3.9414 3.9445 3.8818 3.7348 3.9544 4.0227 3.7507 3.9452 4.0391 3.7883 3.9717 3.9301 3.8796 3.8784 3.9100 1.0270 1.0395 1.0109 1.0064 1.0145 1.0062 1.0221 1.0280 1.0153 0.9987 1.0109 0.9975 1.0007 1.0125 1.0001 1.0099 0.9882 1.0139 1.0096 0.9995 1.0154 1.0155 1.0025 0.9993 0.9990 1.0002
dispcorr: -0.027685351 hartree
energy: -1117.874473347005
dipole: -31.51910 31.08182 -0.43729 1.31184 -0.97857 0.33327 -0.39642 1.03798 0.64156
magnitude: 0.84492 au
magnitude: 2.14762 debye
