program: Orca
programVersion: 5.0.2
elementType: O O O C C C C C C C C C C C C C C C C C C C C C C C H H H H H H H H H H H H H H H H H H H H H H H H H H
charge: 0
multiplicity: 1
keywords: wb97x-d3
keywords: def2-TZVPP
keywords: def2/J RIJCOSX
keywords: DEFGRID2
keywords: scfconv7
keywords: smallprint printgap noloewdin
keywords: NOSOSCF
formula: C23H26O3
InChI: InChI=1/C23H26O3/c1-16(2)13-20-21(23(20,3)4)22(24)25-15-17-9-8-12-19(14-17)26-18-10-6-5-7-11-18/h5-14,20-21H,15H2,1-4H3
52 atoms
O  0.716929 -2.370916 -1.105483
O  0.216228 -2.273011 1.073655
O  3.13685 2.020724 -0.455174
C  -2.733667 -2.107944 -0.009109
C  -2.242958 -0.736076 0.33151
C  -1.40591 -1.616873 -0.563237
C  -3.843999 -2.251468 -1.021687
C  -2.776958 -3.158784 1.071889
C  -2.837835 0.505082 -0.229441
C  -0.103998 -2.115803 -0.073834
C  -3.978926 1.060728 0.179576
C  -4.475714 2.343237 -0.416351
C  -4.842092 0.475497 1.255021
C  2.043815 -2.761584 -0.792863
C  2.887315 -1.624994 -0.279489
C  2.6030 -0.312852 -0.626809
C  3.991224 -1.897402 0.520279
C  3.393996 0.718632 -0.13874
C  4.799746 -0.8650 0.965936
C  4.500341 0.45155 0.651381
C  1.870266 2.512303 -0.334793
C  1.533527 3.572989 -1.165552
C  0.953993 2.030772 0.594594
C  0.278208 4.151804 -1.065829
C  -0.300393 2.615684 0.676159
C  -0.647965 3.673892 -0.150569
H  -1.844375 -0.644936 1.339546
H  -1.419768 -1.373553 -1.620397
H  -3.800654 -1.488632 -1.797672
H  -4.817494 -2.165394 -0.534812
H  -3.799254 -3.229349 -1.503955
H  -2.673526 -4.1592 0.647218
H  -3.742764 -3.119451 1.580266
H  -2.000188 -3.03079 1.821358
H  -2.269106 1.006837 -1.006627
H  -3.801826 2.724571 -1.182809
H  -4.586714 3.115534 0.349359
H  -5.461745 2.212308 -0.868972
H  -4.450281 -0.45984 1.650409
H  -5.851489 0.286341 0.88115
H  -4.949487 1.172875 2.089859
H  2.450121 -3.136949 -1.73377
H  2.049803 -3.585458 -0.074982
H  1.756786 -0.082043 -1.26172
H  4.213545 -2.918409 0.805343
H  5.657383 -1.082604 1.588488
H  5.10943 1.267096 1.017481
H  2.25833 3.938938 -1.880733
H  1.205715 1.206485 1.249137
H  0.023818 4.979391 -1.71494
H  -1.013923 2.234198 1.393976
H  -1.630066 4.121234 -0.078558
totalener: -1117.84669264 hartree
nucrepener: 2333.16501743 hartree
electener: -3451.01171007 hartree
oneelecener: -6155.05919861 hartree
twoeener: 2704.04748854 hartree
kineticenergy: 1112.85935063 hartree
xcener: -110.236090411289 hartree
chargesum: -0.0000000
charge: -0.280427 -0.376535 -0.301124 0.064410 -0.034126 -0.028062 -0.249847 -0.261878 -0.247316 0.304472 0.004938 -0.236224 -0.248009 0.064968 0.087825 -0.229267 -0.193807 0.244722 -0.084433 -0.214104 0.273030 -0.226199 -0.174886 -0.076542 -0.102532 -0.184708 0.104567 0.082121 0.084816 0.084257 0.097005 0.088129 0.079603 0.104271 0.111555 0.080504 0.087767 0.094431 0.084419 0.090186 0.097059 0.108124 0.102337 0.130627 0.104138 0.123907 0.124546 0.122342 0.137063 0.123022 0.129105 0.129759
qa: -0.2804 -0.3765 -0.3011 0.0644 -0.0341 -0.0281 -0.2498 -0.2619 -0.2473 0.3045 0.0049 -0.2362 -0.2480 0.0650 0.0878 -0.2293 -0.1938 0.2447 -0.0844 -0.2141 0.2730 -0.2262 -0.1749 -0.0765 -0.1025 -0.1847 0.1046 0.0821 0.0848 0.0843 0.0970 0.0881 0.0796 0.1043 0.1116 0.0805 0.0878 0.0944 0.0844 0.0902 0.0971 0.1081 0.1023 0.1306 0.1041 0.1239 0.1245 0.1223 0.1371 0.1230 0.1291 0.1298
va: 2.1163 2.1195 2.1130 3.8112 3.7984 3.7914 3.9067 3.8988 3.8565 4.2420 3.6613 3.9388 3.9415 3.8642 3.6322 3.9692 4.0407 3.8205 3.9403 4.0644 3.7852 4.0452 3.8999 3.9354 3.9006 3.9462 1.0226 1.0349 1.0068 1.0024 1.0063 1.0033 1.0029 1.0225 0.9957 1.0096 0.9960 1.0024 1.0094 0.9982 1.0040 0.9864 1.0107 1.0204 1.0112 0.9993 1.0121 1.0151 1.0084 0.9985 0.9982 0.9964
dispcorr: -0.028511096 hartree
energy: -1117.875203739250
dipole: -32.33907 31.68156 -0.65751 -2.93675 2.74839 -0.18836 2.05822 -2.40323 -0.34501
magnitude: 0.76605 au
magnitude: 1.94714 debye
