program: Orca
programVersion: 5.0.2
elementType: O O O C C C C C C C C C C C C C C C C C C C C C C C H H H H H H H H H H H H H H H H H H H H H H H H H H
charge: 0
multiplicity: 1
keywords: wb97x-d3
keywords: def2-TZVPP
keywords: def2/J RIJCOSX
keywords: DEFGRID2
keywords: scfconv7
keywords: smallprint printgap noloewdin
keywords: NOSOSCF
formula: C23H26O3
InChI: InChI=1/C23H26O3/c1-16(2)13-20-21(23(20,3)4)22(24)25-15-17-9-8-12-19(14-17)26-18-10-6-5-7-11-18/h5-14,20-21H,15H2,1-4H3
52 atoms
O  -0.011512 -1.642109 -1.325957
O  0.223685 -3.668894 -0.406035
O  3.553371 1.986616 0.57055
C  -2.115066 -1.35388 0.952914
C  -2.724269 -1.383323 -0.419283
C  -1.778482 -2.479542 -0.009517
C  -2.973904 -1.738266 2.133082
C  -1.096422 -0.289461 1.281831
C  -4.159698 -1.697464 -0.639199
C  -0.427467 -2.674187 -0.584618
C  -5.142784 -0.796807 -0.616221
C  -6.567291 -1.182483 -0.874004
C  -4.912112 0.658051 -0.342206
C  1.328203 -1.676793 -1.822204
C  2.302841 -1.186044 -0.78971
C  2.456028 0.183055 -0.599156
C  3.033776 -2.07601 -0.012393
C  3.330716 0.657035 0.36871
C  3.916554 -1.592255 0.941928
C  4.065665 -0.230449 1.143239
C  2.538841 2.87993 0.380299
C  2.812072 4.017836 -0.363082
C  1.285412 2.693994 0.951177
C  1.824463 4.976892 -0.533393
C  0.304288 3.65432 0.763674
C  0.566623 4.797609 0.021672
H  -2.303557 -0.659216 -1.110545
H  -2.22864 -3.431744 0.25158
H  -3.552313 -0.880059 2.481493
H  -2.354363 -2.083692 2.962506
H  -3.682605 -2.528971 1.891515
H  -0.35904 -0.659076 1.997451
H  -1.597128 0.567066 1.739664
H  -0.55901 0.073046 0.408771
H  -4.411958 -2.733619 -0.845697
H  -6.97091 -0.643804 -1.735073
H  -7.203583 -0.928552 -0.022507
H  -6.674762 -2.249104 -1.067087
H  -5.199271 1.266742 -1.203514
H  -3.8747 0.884333 -0.103295
H  -5.528704 0.996154 0.494302
H  1.320219 -1.014348 -2.687648
H  1.586556 -2.679932 -2.163256
H  1.89424 0.877697 -1.212881
H  2.905671 -3.140946 -0.148644
H  4.488368 -2.284292 1.545847
H  4.749131 0.151843 1.889881
H  3.794797 4.147866 -0.796778
H  1.078839 1.808981 1.539566
H  2.040505 5.865484 -1.111729
H  -0.671581 3.507492 1.207722
H  -0.202542 5.544934 -0.118348
totalener: -1117.84467090 hartree
nucrepener: 2276.65357438 hartree
electener: -3394.49824528 hartree
oneelecener: -6041.73087163 hartree
twoeener: 2647.23262634 hartree
kineticenergy: 1112.86308529 hartree
xcener: -110.232637491174 hartree
chargesum: -0.0000000
charge: -0.262610 -0.371051 -0.300951 0.118111 0.012003 -0.116301 -0.246046 -0.318626 -0.217913 0.348020 -0.023528 -0.211394 -0.235800 0.018045 0.006946 -0.222839 -0.132054 0.245615 -0.099863 -0.201625 0.246249 -0.197282 -0.185431 -0.098167 -0.119004 -0.137541 0.102449 0.082377 0.084092 0.097917 0.082248 0.111774 0.087093 0.089239 0.091768 0.085714 0.084025 0.079891 0.096152 0.076919 0.085456 0.103128 0.112112 0.122809 0.125867 0.125526 0.125600 0.126095 0.151550 0.125798 0.122427 0.125012
qa: -0.2626 -0.3711 -0.3010 0.1181 0.0120 -0.1163 -0.2460 -0.3186 -0.2179 0.3480 -0.0235 -0.2114 -0.2358 0.0180 0.0069 -0.2228 -0.1321 0.2456 -0.0999 -0.2016 0.2462 -0.1973 -0.1854 -0.0982 -0.1190 -0.1375 0.1024 0.0824 0.0841 0.0979 0.0822 0.1118 0.0871 0.0892 0.0918 0.0857 0.0840 0.0799 0.0962 0.0769 0.0855 0.1031 0.1121 0.1228 0.1259 0.1255 0.1256 0.1261 0.1516 0.1258 0.1224 0.1250
va: 2.1036 2.1322 2.1132 3.7298 3.7709 3.8949 3.9054 3.9081 3.8616 4.2755 3.7394 3.9414 3.9423 3.8875 3.6613 3.9238 3.9741 3.8245 3.9606 4.0304 3.8206 4.0324 3.9472 3.9341 3.9497 3.9631 1.0208 1.0328 1.0030 1.0044 1.0079 0.9979 0.9997 1.0110 1.0145 0.9977 0.9989 1.0106 1.0015 1.0105 1.0005 0.9989 1.0099 1.0133 1.0231 0.9993 1.0125 1.0132 0.9883 0.9989 1.0035 1.0005
dispcorr: -0.026851531 hartree
energy: -1117.871522430650
dipole: -31.44802 30.71754 -0.73048 -0.02193 0.90401 0.88208 3.70551 -3.80248 -0.09696
magnitude: 1.14937 au
magnitude: 2.92148 debye
