program: Orca
programVersion: 5.0.2
elementType: O O O C C C C C C C C C C C C C C C C C C C C C C C H H H H H H H H H H H H H H H H H H H H H H H H H H
charge: 0
multiplicity: 1
keywords: wb97x-d3
keywords: def2-TZVPP
keywords: def2/J RIJCOSX
keywords: DEFGRID2
keywords: scfconv7
keywords: smallprint printgap noloewdin
keywords: NOSOSCF
formula: C23H26O3
InChI: InChI=1/C23H26O3/c1-16(2)13-20-21(23(20,3)4)22(24)25-15-17-9-8-12-19(14-17)26-18-10-6-5-7-11-18/h5-14,20-21H,15H2,1-4H3
52 atoms
O  0.008541 -1.631719 -1.358849
O  0.189516 -3.671814 -0.456644
O  3.545037 1.923806 0.690081
C  -2.133431 -1.354873 0.893623
C  -2.707123 -1.318872 -0.493969
C  -1.805212 -2.456158 -0.099363
C  -3.033794 -1.751635 2.037734
C  -1.090314 -0.33591 1.283897
C  -4.144903 -1.579902 -0.763028
C  -0.442274 -2.665796 -0.640829
C  -5.101476 -0.651684 -0.724137
C  -6.528819 -0.980519 -1.038075
C  -4.835834 0.781155 -0.375837
C  1.360119 -1.683963 -1.820122
C  2.31419 -1.217668 -0.757598
C  2.468332 0.146937 -0.537994
C  3.023972 -2.125277 0.018546
C  3.323539 0.599103 0.457085
C  3.888215 -1.663093 1.000236
C  4.03844 -0.306024 1.23018
C  2.538645 2.822868 0.4828
C  1.273208 2.637562 1.026478
C  2.82985 3.962769 -0.249905
C  0.298039 3.600274 0.822502
C  1.847568 4.924289 -0.437252
C  0.57812 4.745557 0.090452
H  -2.247087 -0.584798 -1.148596
H  -2.287425 -3.403861 0.117302
H  -2.447184 -2.145522 2.869416
H  -3.760835 -2.509889 1.750671
H  -3.593374 -0.887566 2.402039
H  -0.519611 0.036913 0.436662
H  -0.38338 -0.753247 2.003872
H  -1.574232 0.521332 1.758067
H  -4.421319 -2.597383 -1.02406
H  -6.662553 -2.032938 -1.284711
H  -6.891196 -0.390048 -1.883251
H  -7.181491 -0.74672 -0.193335
H  -5.459471 1.096389 0.464528
H  -5.088791 1.438601 -1.211616
H  -3.797683 0.966143 -0.106903
H  1.385919 -1.014513 -2.679871
H  1.611665 -2.688329 -2.162531
H  1.922016 0.854996 -1.150277
H  2.893694 -3.186933 -0.13986
H  4.443847 -2.368731 1.60351
H  4.706865 0.059058 1.998727
H  1.053427 1.750457 1.606431
H  3.821551 4.092349 -0.662437
H  -0.687515 3.453171 1.244305
H  2.077307 5.814888 -1.00671
H  -0.186479 5.494906 -0.062966
totalener: -1117.84456334 hartree
nucrepener: 2280.45224289 hartree
electener: -3398.29680623 hartree
oneelecener: -6049.32660481 hartree
twoeener: 2651.02979858 hartree
kineticenergy: 1112.86891067 hartree
xcener: -110.233757065433 hartree
chargesum: -0.0000000
charge: -0.262362 -0.370488 -0.301132 0.115377 0.012414 -0.114003 -0.246831 -0.316511 -0.218833 0.347110 -0.023595 -0.211759 -0.235730 0.018194 0.006086 -0.225649 -0.131732 0.246795 -0.099404 -0.201534 0.244793 -0.187108 -0.195516 -0.119007 -0.099273 -0.136593 0.102850 0.082599 0.098267 0.082172 0.084069 0.087484 0.112911 0.086827 0.091764 0.080050 0.085763 0.084165 0.085715 0.096009 0.076780 0.103664 0.111473 0.123813 0.125251 0.125512 0.125606 0.154365 0.126263 0.121849 0.125865 0.125206
qa: -0.2624 -0.3705 -0.3011 0.1154 0.0124 -0.1140 -0.2468 -0.3165 -0.2188 0.3471 -0.0236 -0.2118 -0.2357 0.0182 0.0061 -0.2256 -0.1317 0.2468 -0.0994 -0.2015 0.2448 -0.1871 -0.1955 -0.1190 -0.0993 -0.1366 0.1028 0.0826 0.0983 0.0822 0.0841 0.0875 0.1129 0.0868 0.0918 0.0801 0.0858 0.0842 0.0857 0.0960 0.0768 0.1037 0.1115 0.1238 0.1253 0.1255 0.1256 0.1544 0.1263 0.1218 0.1259 0.1252
va: 2.1044 2.1326 2.1135 3.7348 3.7690 3.8922 3.9054 3.9081 3.8626 4.2775 3.7406 3.9413 3.9422 3.8887 3.6626 3.9187 3.9750 3.8225 3.9602 4.0298 3.8244 3.9484 4.0314 3.9494 3.9340 3.9625 1.0209 1.0326 1.0044 1.0078 1.0028 1.0108 0.9980 0.9994 1.0145 1.0106 0.9978 0.9987 1.0003 1.0018 1.0104 0.9985 1.0103 1.0131 1.0228 0.9993 1.0125 0.9859 1.0130 1.0039 0.9989 1.0004
dispcorr: -0.026976281 hartree
energy: -1117.871539621817
dipole: -31.28868 30.57928 -0.70940 0.49543 0.39809 0.89352 3.13274 -3.23389 -0.10115
magnitude: 1.14536 au
magnitude: 2.91128 debye
