program: Orca
programVersion: 5.0.2
elementType: O O O C C C C C C C C C C C C C C C C C C C C C C C H H H H H H H H H H H H H H H H H H H H H H H H H H
charge: 0
multiplicity: 1
keywords: wb97x-d3
keywords: def2-TZVPP
keywords: def2/J RIJCOSX
keywords: DEFGRID2
keywords: scfconv7
keywords: smallprint printgap noloewdin
keywords: NOSOSCF
formula: C23H26O3
InChI: InChI=1/C23H26O3/c1-16(2)13-20-21(23(20,3)4)22(24)25-15-17-9-8-12-19(14-17)26-18-10-6-5-7-11-18/h5-14,20-21H,15H2,1-4H3
52 atoms
O  0.503964 -2.172539 -0.198818
O  -0.702226 -3.282951 1.32982
O  2.80316 2.237768 0.660613
C  -3.102826 -2.626238 -0.58028
C  -3.035051 -1.583548 0.483432
C  -1.787266 -1.917007 -0.312817
C  -3.761992 -2.279886 -1.895148
C  -3.294225 -4.069599 -0.183615
C  -3.673982 -0.25123 0.324674
C  -0.646631 -2.553977 0.375069
C  -3.113835 0.917846 0.640031
C  -3.837136 2.212683 0.426667
C  -1.735368 1.050909 1.212362
C  1.734194 -2.545767 0.404491
C  2.700123 -1.402124 0.276574
C  2.272846 -0.098154 0.495693
C  4.037987 -1.643474 -0.009995
C  3.178734 0.948636 0.414474
C  4.940252 -0.592114 -0.067229
C  4.516367 0.710988 0.134088
C  1.69847 2.762187 0.06203
C  1.047615 3.783482 0.743125
C  1.249299 2.357811 -1.190259
C  -0.046889 4.405485 0.165354
C  0.146296 2.984316 -1.751188
C  -0.50672 4.00886 -1.082372
H  -3.022916 -1.980742 1.496166
H  -1.501236 -1.185704 -1.059919
H  -3.597058 -1.241766 -2.183621
H  -4.840572 -2.440852 -1.838389
H  -3.377232 -2.913338 -2.695909
H  -2.84653 -4.738855 -0.920787
H  -4.360968 -4.297138 -0.139492
H  -2.86227 -4.303228 0.785682
H  -4.68631 -0.247211 -0.07045
H  -3.254972 2.876292 -0.217832
H  -3.978632 2.743928 1.371107
H  -4.816184 2.068293 -0.028762
H  -1.744209 1.704182 2.087529
H  -1.059616 1.517184 0.490239
H  -1.307467 0.098641 1.517513
H  2.125981 -3.436546 -0.093904
H  1.582469 -2.80239 1.455544
H  1.234438 0.107991 0.724399
H  4.378373 -2.655606 -0.190742
H  5.980966 -0.786425 -0.289694
H  5.208842 1.540185 0.077059
H  1.409432 4.087119 1.716691
H  1.753677 1.567595 -1.730414
H  -0.546402 5.202842 0.699621
H  -0.198732 2.668136 -2.726789
H  -1.362093 4.495977 -1.530656
totalener: -1117.84678936 hartree
nucrepener: 2318.40111879 hartree
electener: -3436.24790814 hartree
oneelecener: -6125.21612279 hartree
twoeener: 2688.96821464 hartree
kineticenergy: 1112.84971775 hartree
xcener: -110.234693636650 hartree
chargesum: 0.0000000
charge: -0.268379 -0.385195 -0.296701 0.119820 -0.001971 -0.091179 -0.266540 -0.260664 -0.259297 0.307662 0.027875 -0.219750 -0.209779 0.044436 0.022483 -0.129122 -0.166600 0.217032 -0.087607 -0.206474 0.242726 -0.201128 -0.146681 -0.081969 -0.100666 -0.196766 0.106431 0.085859 0.085201 0.089054 0.090872 0.084136 0.082051 0.103249 0.091861 0.080650 0.087544 0.080194 0.095858 0.049090 0.088066 0.091152 0.114044 0.097364 0.108746 0.124965 0.125666 0.123954 0.129267 0.123991 0.125191 0.129977
qa: -0.2684 -0.3852 -0.2967 0.1198 -0.0020 -0.0912 -0.2665 -0.2607 -0.2593 0.3077 0.0279 -0.2197 -0.2098 0.0444 0.0225 -0.1291 -0.1666 0.2170 -0.0876 -0.2065 0.2427 -0.2011 -0.1467 -0.0820 -0.1007 -0.1968 0.1064 0.0859 0.0852 0.0891 0.0909 0.0841 0.0821 0.1032 0.0919 0.0806 0.0875 0.0802 0.0959 0.0491 0.0881 0.0912 0.1140 0.0974 0.1087 0.1250 0.1257 0.1240 0.1293 0.1240 0.1252 0.1300
va: 2.1138 2.1145 2.1121 3.7531 3.7962 3.8123 3.9049 3.9050 3.9020 4.2183 3.6955 3.9430 3.9611 3.8594 3.7662 3.9336 3.9899 3.8379 3.9518 4.0421 3.8049 3.9955 3.8913 3.8907 3.8891 3.9306 1.0233 1.0306 1.0061 1.0023 1.0064 1.0022 1.0018 1.0218 1.0102 1.0050 0.9993 1.0122 1.0062 1.0106 1.0150 0.9991 1.0120 1.0254 1.0127 0.9997 1.0126 1.0146 1.0073 1.0000 1.0015 1.0003
dispcorr: -0.028092304 hartree
energy: -1117.874881659500
dipole: -24.30885 24.29929 -0.00956 -2.33459 2.74947 0.41488 -4.06642 3.39381 -0.67261
magnitude: 0.79033 au
magnitude: 2.00887 debye
