program: Orca
programVersion: 5.0.2
elementType: O O O C C C C C C C C C C C C C C C C C C C C C C C H H H H H H H H H H H H H H H H H H H H H H H H H H
charge: 0
multiplicity: 1
keywords: wb97x-d3
keywords: def2-TZVPP
keywords: def2/J RIJCOSX
keywords: DEFGRID2
keywords: scfconv7
keywords: smallprint printgap noloewdin
keywords: NOSOSCF
formula: C23H26O3
InChI: InChI=1/C23H26O3/c1-16(2)13-20-21(23(20,3)4)22(24)25-15-17-9-8-12-19(14-17)26-18-10-6-5-7-11-18/h5-14,20-21H,15H2,1-4H3
52 atoms
O  -0.807633 -1.149826 1.406147
O  -0.722754 -2.959469 0.086857
O  3.233164 2.514242 0.96552
C  -3.059153 -1.454937 -1.375295
C  -3.599286 -2.573175 -0.550695
C  -2.66534 -1.567704 0.089449
C  -3.961325 -0.291112 -1.7086
C  -2.062803 -1.764327 -2.465905
C  -5.028028 -2.639845 -0.148216
C  -1.309531 -1.989923 0.496257
C  -5.482337 -3.082822 1.025012
C  -6.950135 -3.138703 1.323371
C  -4.589903 -3.563326 2.12806
C  0.518721 -1.387667 1.883858
C  1.542285 -0.692488 1.030863
C  1.923609 0.607078 1.33895
C  2.098288 -1.323512 -0.077694
C  2.861421 1.26788 0.558485
C  3.027126 -0.652761 -0.856909
C  3.420719 0.639694 -0.546895
C  3.588255 3.455328 0.042781
C  2.804413 3.719285 -1.074203
C  4.739664 4.18928 0.28318
C  3.186394 4.721891 -1.951001
C  5.105017 5.196854 -0.596969
C  4.334599 5.465619 -1.717843
H  -3.128444 -3.534703 -0.742334
H  -3.123018 -0.832487 0.741228
H  -4.654881 -0.05495 -0.901617
H  -4.552543 -0.504849 -2.601678
H  -3.37057 0.603514 -1.911642
H  -2.593938 -1.960441 -3.399414
H  -1.450066 -2.634473 -2.245067
H  -1.395131 -0.918106 -2.638325
H  -5.75437 -2.330247 -0.894693
H  -7.195017 -2.539089 2.203534
H  -7.266838 -4.160552 1.546188
H  -7.552358 -2.775602 0.491506
H  -3.534522 -3.530793 1.868346
H  -4.833862 -4.594297 2.395946
H  -4.734467 -2.967093 3.032547
H  0.720323 -2.458056 1.94196
H  0.529966 -0.983343 2.895942
H  1.501482 1.116321 2.197156
H  1.801724 -2.332198 -0.329546
H  3.463852 -1.14597 -1.715155
H  4.15948 1.145233 -1.15502
H  1.901638 3.149835 -1.254271
H  5.338272 3.971441 1.157829
H  2.573308 4.928445 -2.818366
H  6.001596 5.771253 -0.405139
H  4.624711 6.24897 -2.404786
totalener: -1117.84747047 hartree
nucrepener: 2171.00250470 hartree
electener: -3288.84997516 hartree
oneelecener: -5830.74749140 hartree
twoeener: 2541.89751624 hartree
kineticenergy: 1112.85622290 hartree
xcener: -110.231158464126 hartree
chargesum: -0.0000000
charge: -0.259864 -0.403637 -0.299414 0.127142 -0.020315 -0.119084 -0.273771 -0.262530 -0.237007 0.360351 -0.007194 -0.210262 -0.226083 0.048720 0.005229 -0.224744 -0.143427 0.217063 -0.120727 -0.153787 0.230079 -0.156296 -0.199808 -0.117427 -0.097286 -0.139465 0.106351 0.087805 0.085280 0.089390 0.091674 0.083698 0.100024 0.087346 0.092016 0.084161 0.086631 0.078801 0.084121 0.090375 0.085983 0.112602 0.098447 0.108732 0.135011 0.126861 0.132447 0.133231 0.125150 0.126826 0.125061 0.125519
qa: -0.2599 -0.4036 -0.2994 0.1271 -0.0203 -0.1191 -0.2738 -0.2625 -0.2370 0.3604 -0.0072 -0.2103 -0.2261 0.0487 0.0052 -0.2247 -0.1434 0.2171 -0.1207 -0.1538 0.2301 -0.1563 -0.1998 -0.1174 -0.0973 -0.1395 0.1064 0.0878 0.0853 0.0894 0.0917 0.0837 0.1000 0.0873 0.0920 0.0842 0.0866 0.0788 0.0841 0.0904 0.0860 0.1126 0.0984 0.1087 0.1350 0.1269 0.1324 0.1332 0.1251 0.1268 0.1251 0.1255
va: 2.1303 2.0938 2.1018 3.7407 3.8172 3.8371 3.9095 3.9020 3.8943 4.1811 3.7408 3.9411 3.9423 3.8523 3.7109 4.0952 3.9380 3.8732 3.9669 3.9329 3.8214 3.9488 4.0345 3.9460 3.9352 3.9564 1.0257 1.0314 1.0054 1.0014 1.0062 1.0026 1.0214 1.0019 1.0101 0.9993 0.9987 1.0099 1.0163 1.0016 1.0011 1.0114 0.9985 1.0240 1.0225 1.0013 1.0042 1.0033 1.0134 0.9998 0.9990 1.0002
dispcorr: -0.023561073 hartree
energy: -1117.871031541220
dipole: -30.47212 30.19345 -0.27867 -12.43669 12.90548 0.46879 -4.59432 4.45817 -0.13615
magnitude: 0.56210 au
magnitude: 1.42875 debye
