program: Orca
programVersion: 5.0.2
elementType: O O O C C C C C C C C C C C C C C C C C C C C C C C H H H H H H H H H H H H H H H H H H H H H H H H H H
charge: 0
multiplicity: 1
keywords: wb97x-d3
keywords: def2-TZVPP
keywords: def2/J RIJCOSX
keywords: DEFGRID2
keywords: scfconv7
keywords: smallprint printgap noloewdin
keywords: NOSOSCF
formula: C23H26O3
InChI: InChI=1/C23H26O3/c1-16(2)13-20-21(23(20,3)4)22(24)25-15-17-9-8-12-19(14-17)26-18-10-6-5-7-11-18/h5-14,20-21H,15H2,1-4H3
52 atoms
O  -0.149371 -1.203365 -1.332052
O  -0.300674 -2.94142 0.068863
O  2.755099 2.780112 0.852686
C  -3.335043 -2.806156 -0.667144
C  -3.108864 -2.109209 0.639426
C  -2.267924 -1.730964 -0.555463
C  -4.556008 -2.433377 -1.472877
C  -2.961062 -4.26203 -0.795494
C  -4.079092 -1.131469 1.193732
C  -0.823676 -2.04944 -0.546952
C  -5.069989 -1.438503 2.031375
C  -5.998142 -0.389883 2.564952
C  -5.335499 -2.833559 2.509346
C  1.273021 -1.332827 -1.372883
C  1.926764 -0.629743 -0.216248
C  2.051916 0.7546 -0.243662
C  2.386047 -1.339264 0.887337
C  2.644958 1.420268 0.819876
C  2.970042 -0.66458 1.948463
C  3.107801 0.713597 1.920354
C  3.122016 3.4547 -0.274896
C  4.136968 3.002976 -1.110017
C  2.475711 4.6530 -0.54072
C  4.494666 3.75906 -2.215222
C  2.849621 5.402967 -1.645148
C  3.854833 4.958762 -2.490472
H  -2.571251 -2.702722 1.37406
H  -2.513669 -0.791596 -1.039174
H  -4.416189 -2.688258 -2.524823
H  -4.790062 -1.371205 -1.413186
H  -5.430211 -2.977816 -1.110194
H  -2.132663 -4.545943 -0.151942
H  -2.687604 -4.506627 -1.823864
H  -3.820138 -4.882105 -0.530644
H  -3.956921 -0.093659 0.897458
H  -7.034497 -0.609133 2.296178
H  -5.756001 0.602642 2.187098
H  -5.961794 -0.350532 3.65654
H  -5.208627 -2.904568 3.592637
H  -4.683615 -3.572233 2.046955
H  -6.36787 -3.124008 2.29941
H  1.565097 -0.869647 -2.315429
H  1.564526 -2.383649 -1.405508
H  1.686564 1.313343 -1.097577
H  2.27379 -2.41412 0.920311
H  3.327264 -1.217081 2.807337
H  3.567509 1.245643 2.742933
H  4.648003 2.072698 -0.897818
H  1.689084 4.991695 0.120221
H  5.287212 3.407002 -2.862142
H  2.343609 6.337417 -1.848195
H  4.141364 5.543888 -3.353638
totalener: -1117.84736181 hartree
nucrepener: 2173.65537824 hartree
electener: -3291.50274005 hartree
oneelecener: -5836.15643580 hartree
twoeener: 2544.65369575 hartree
kineticenergy: 1112.86210822 hartree
xcener: -110.231397053573 hartree
chargesum: -0.0000000
charge: -0.266628 -0.404902 -0.302448 0.104667 -0.033907 -0.114207 -0.240140 -0.273817 -0.182425 0.374762 -0.030382 -0.212496 -0.235227 0.049549 -0.013295 -0.170886 -0.120351 0.201591 -0.104840 -0.194519 0.228751 -0.149408 -0.203260 -0.120913 -0.094428 -0.144202 0.106824 0.076224 0.092306 0.080422 0.086660 0.104806 0.087596 0.081591 0.089782 0.083488 0.079114 0.086207 0.094562 0.080964 0.083598 0.108934 0.105699 0.118128 0.121799 0.125292 0.126030 0.131766 0.125502 0.126186 0.124835 0.125046
qa: -0.2666 -0.4049 -0.3024 0.1047 -0.0339 -0.1142 -0.2401 -0.2738 -0.1824 0.3748 -0.0304 -0.2125 -0.2352 0.0495 -0.0133 -0.1709 -0.1204 0.2016 -0.1048 -0.1945 0.2288 -0.1494 -0.2033 -0.1209 -0.0944 -0.1442 0.1068 0.0762 0.0923 0.0804 0.0867 0.1048 0.0876 0.0816 0.0898 0.0835 0.0791 0.0862 0.0946 0.0810 0.0836 0.1089 0.1057 0.1181 0.1218 0.1253 0.1260 0.1318 0.1255 0.1262 0.1248 0.1250
va: 2.1335 2.0947 2.1014 3.6959 3.8150 3.9052 3.9071 3.9034 3.8565 4.2110 3.7369 3.9404 3.9415 3.8626 3.6853 3.9566 3.9542 3.8524 3.9582 4.0299 3.8315 3.9284 4.0300 3.9508 3.9366 3.9584 1.0245 1.0371 1.0053 1.0076 1.0042 1.0221 1.0032 1.0014 1.0137 0.9987 1.0108 0.9977 1.0010 1.0113 1.0003 0.9945 1.0123 1.0153 1.0230 0.9997 1.0114 1.0044 1.0135 0.9999 0.9988 1.0003
dispcorr: -0.023392679 hartree
energy: -1117.870754485681
dipole: -32.91753 32.55724 -0.36029 -15.29628 15.47133 0.17506 2.37184 -2.80385 -0.43201
magnitude: 0.58914 au
magnitude: 1.49748 debye
