program: Orca
programVersion: 5.0.2
elementType: O O O C C C C C C C C C C C C C C C C C C C C C C C H H H H H H H H H H H H H H H H H H H H H H H H H H
charge: 0
multiplicity: 1
keywords: wb97x-d3
keywords: def2-TZVPP
keywords: def2/J RIJCOSX
keywords: DEFGRID2
keywords: scfconv7
keywords: smallprint printgap noloewdin
keywords: NOSOSCF
formula: C23H26O3
InChI: InChI=1/C23H26O3/c1-16(2)13-20-21(23(20,3)4)22(24)25-15-17-9-8-12-19(14-17)26-18-10-6-5-7-11-18/h5-14,20-21H,15H2,1-4H3
52 atoms
O  -0.398277 -1.588911 -1.432432
O  -1.169467 0.171891 -0.286445
O  3.358951 1.717544 1.308723
C  -2.480506 -2.11218 1.4413
C  -3.502884 -1.457384 0.575718
C  -2.220681 -1.963445 -0.049976
C  -2.722602 -3.525887 1.914725
C  -1.719818 -1.27386 2.439144
C  -4.798881 -2.109085 0.255611
C  -1.232532 -0.996186 -0.570486
C  -5.434757 -2.024422 -0.913667
C  -6.748833 -2.708495 -1.139476
C  -4.906134 -1.25206 -2.083454
C  0.671113 -0.800045 -1.95342
C  1.803423 -0.694772 -0.971147
C  2.05043 0.499272 -0.30881
C  2.591045 -1.80993 -0.701715
C  3.094833 0.580852 0.604825
C  3.617358 -1.724197 0.223683
C  3.879958 -0.529675 0.87638
C  3.192862 2.934537 0.71246
C  2.540564 3.922337 1.434722
C  3.702322 3.205056 -0.552155
C  2.402339 5.1899 0.889205
C  3.549307 4.47342 -1.088936
C  2.899612 5.470258 -0.37454
H  -3.537162 -0.374192 0.667494
H  -2.292906 -2.883178 -0.619158
H  -1.776644 -4.021289 2.139039
H  -3.24702 -4.130997 1.175219
H  -3.319629 -3.528526 2.829318
H  -2.255384 -1.262219 3.390389
H  -1.594388 -0.243253 2.116974
H  -0.727593 -1.689782 2.624351
H  -5.267783 -2.67624 1.054868
H  -6.687174 -3.409886 -1.975479
H  -7.529457 -1.988025 -1.395835
H  -7.078822 -3.261915 -0.261158
H  -4.730814 -1.910991 -2.937925
H  -3.977255 -0.730076 -1.865716
H  -5.636002 -0.508184 -2.412072
H  0.316396 0.188005 -2.251625
H  0.992396 -1.329832 -2.850495
H  1.41476 1.35595 -0.493442
H  2.399657 -2.744507 -1.214091
H  4.231033 -2.590357 0.432983
H  4.686229 -0.452407 1.593858
H  2.149065 3.693545 2.417266
H  4.217875 2.434055 -1.110669
H  1.894411 5.959264 1.455656
H  3.947058 4.683561 -2.073224
H  2.785226 6.458359 -0.798953
totalener: -1117.84694211 hartree
nucrepener: 2218.29261278 hartree
electener: -3336.13955489 hartree
oneelecener: -5925.58940559 hartree
twoeener: 2589.44985070 hartree
kineticenergy: 1112.85682494 hartree
xcener: -110.230816032337 hartree
chargesum: 0.0000000
charge: -0.264278 -0.396291 -0.300768 0.125078 -0.019353 -0.117598 -0.275769 -0.256728 -0.237698 0.357494 -0.005261 -0.211311 -0.226823 0.046856 -0.024821 -0.086446 -0.195992 0.196708 -0.086951 -0.209263 0.229498 -0.195844 -0.152155 -0.094759 -0.118250 -0.141066 0.106046 0.084690 0.092319 0.084153 0.089738 0.082473 0.100666 0.089008 0.092621 0.084025 0.086624 0.078687 0.086466 0.083237 0.089696 0.103920 0.112031 0.126097 0.111222 0.124120 0.125676 0.124426 0.129242 0.124508 0.125569 0.124529
qa: -0.2643 -0.3963 -0.3008 0.1251 -0.0194 -0.1176 -0.2758 -0.2567 -0.2377 0.3575 -0.0053 -0.2113 -0.2268 0.0469 -0.0248 -0.0864 -0.1960 0.1967 -0.0870 -0.2093 0.2295 -0.1958 -0.1522 -0.0948 -0.1182 -0.1411 0.1060 0.0847 0.0923 0.0842 0.0897 0.0825 0.1007 0.0890 0.0926 0.0840 0.0866 0.0787 0.0865 0.0832 0.0897 0.1039 0.1120 0.1261 0.1112 0.1241 0.1257 0.1244 0.1292 0.1245 0.1256 0.1245
va: 2.1255 2.1030 2.1055 3.7489 3.8196 3.8231 3.9082 3.9020 3.8973 4.1897 3.7343 3.9419 3.9423 3.8706 3.6903 3.8397 4.0173 3.8665 3.9348 4.0408 3.8333 4.0399 3.9455 3.9363 3.9488 3.9595 1.0264 1.0315 1.0063 1.0051 1.0012 1.0021 1.0212 1.0016 1.0097 0.9990 0.9987 1.0098 1.0009 1.0179 1.0019 1.0114 0.9921 1.0271 1.0130 0.9990 1.0124 1.0137 1.0051 0.9992 1.0000 1.0005
dispcorr: -0.024074624 hartree
energy: -1117.871016732441
dipole: -28.74052 28.56366 -0.17686 -14.40090 13.91407 -0.48683 -0.41580 -0.06134 -0.47713
magnitude: 0.70423 au
magnitude: 1.79001 debye
