program: Orca
programVersion: 5.0.2
elementType: O O O C C C C C C C C C C C C C C C C C C C C C C C H H H H H H H H H H H H H H H H H H H H H H H H H H
charge: 0
multiplicity: 1
keywords: wb97x-d3
keywords: def2-TZVPP
keywords: def2/J RIJCOSX
keywords: DEFGRID2
keywords: scfconv7
keywords: smallprint printgap noloewdin
keywords: NOSOSCF
formula: C23H26O3
InChI: InChI=1/C23H26O3/c1-16(2)13-20-21(23(20,3)4)22(24)25-15-17-9-8-12-19(14-17)26-18-10-6-5-7-11-18/h5-14,20-21H,15H2,1-4H3
52 atoms
O  0.477097 -2.551359 -0.169734
O  -0.240299 -1.302445 -1.889815
O  3.10873 1.528731 1.281596
C  -2.214749 -0.294502 0.369475
C  -2.931118 -1.174738 -0.607575
C  -1.649556 -1.662831 0.012476
C  -2.757682 -0.164521 1.771339
C  -1.551721 0.964084 -0.131635
C  -4.202897 -1.873977 -0.285762
C  -0.429845 -1.794905 -0.81027
C  -5.40375 -1.296571 -0.234734
C  -6.640056 -2.087346 0.069589
C  -5.623479 0.164478 -0.482119
C  1.741799 -2.744308 -0.774293
C  2.771924 -1.746603 -0.311955
C  2.424692 -0.543185 0.281635
C  4.117571 -2.047021 -0.507165
C  3.416797 0.355542 0.655722
C  5.098031 -1.151025 -0.119334
C  4.755451 0.062353 0.458093
C  2.153223 2.349927 0.761808
C  1.928381 2.475319 -0.604147
C  1.4293 3.117623 1.665136
C  0.976391 3.377155 -1.054842
C  0.486992 4.020318 1.198432
C  0.252573 4.153395 -0.162389
H  -2.821144 -0.868114 -1.645273
H  -1.740119 -2.404777 0.799044
H  -1.962301 0.116409 2.463831
H  -3.211093 -1.086677 2.131818
H  -3.523166 0.613097 1.812715
H  -1.191534 0.879838 -1.153807
H  -0.706561 1.248564 0.49877
H  -2.263603 1.79158 -0.098284
H  -4.13754 -2.942997 -0.10338
H  -7.358933 -2.02454 -0.751041
H  -7.146163 -1.698086 0.956636
H  -6.421291 -3.140234 0.242507
H  -6.28738 0.315631 -1.337072
H  -4.699487 0.704738 -0.678682
H  -6.112998 0.633855 0.374976
H  1.659426 -2.711132 -1.863664
H  2.054853 -3.751316 -0.493361
H  1.390106 -0.290236 0.47258
H  4.400255 -2.990909 -0.958093
H  6.141146 -1.395359 -0.270043
H  5.513003 0.771897 0.762533
H  2.486944 1.87901 -1.313686
H  1.617004 3.008139 2.725249
H  0.803159 3.471491 -2.118726
H  -0.071487 4.617975 1.906935
H  -0.486505 4.85513 -0.524146
totalener: -1117.84671209 hartree
nucrepener: 2301.06061665 hartree
electener: -3418.90732874 hartree
oneelecener: -6090.82063245 hartree
twoeener: 2671.91330371 hartree
kineticenergy: 1112.84845868 hartree
xcener: -110.234630765230 hartree
chargesum: -0.0000000
charge: -0.268991 -0.369709 -0.298675 0.106337 -0.018675 -0.094203 -0.249623 -0.275643 -0.193166 0.298181 -0.021876 -0.211186 -0.243200 0.052945 0.042905 -0.146641 -0.186459 0.207898 -0.092905 -0.198240 0.215620 -0.125720 -0.188964 -0.133806 -0.097647 -0.146949 0.108974 0.080990 0.098631 0.084786 0.084174 0.110646 0.057175 0.087160 0.088063 0.086275 0.084173 0.079203 0.098098 0.082555 0.087315 0.113308 0.106354 0.122042 0.107471 0.124104 0.124826 0.128461 0.122354 0.126669 0.122176 0.122409
qa: -0.2690 -0.3697 -0.2987 0.1063 -0.0187 -0.0942 -0.2496 -0.2756 -0.1932 0.2982 -0.0219 -0.2112 -0.2432 0.0529 0.0429 -0.1466 -0.1865 0.2079 -0.0929 -0.1982 0.2156 -0.1257 -0.1890 -0.1338 -0.0976 -0.1469 0.1090 0.0810 0.0986 0.0848 0.0842 0.1106 0.0572 0.0872 0.0881 0.0863 0.0842 0.0792 0.0981 0.0826 0.0873 0.1133 0.1064 0.1220 0.1075 0.1241 0.1248 0.1285 0.1224 0.1267 0.1222 0.1224
va: 2.1241 2.1280 2.1075 3.7269 3.8145 3.8536 3.9019 3.8872 3.8688 4.2799 3.7379 3.9379 3.9335 3.8865 3.7032 3.9700 3.9988 3.8613 3.9467 4.0314 3.8184 3.8817 3.9814 3.9131 3.9225 3.9125 1.0264 1.0360 1.0051 1.0076 1.0016 1.0157 1.0132 1.0080 1.0132 0.9982 0.9989 1.0107 1.0038 1.0126 0.9988 1.0102 0.9905 0.9942 1.0101 1.0000 1.0123 1.0073 1.0152 1.0013 0.9997 1.0017
dispcorr: -0.027898752 hartree
energy: -1117.874610838671
dipole: -31.70562 31.27917 -0.42645 0.15571 -0.32247 -0.16676 1.48244 -1.23097 0.25146
magnitude: 0.52240 au
magnitude: 1.32784 debye
