program: Orca
programVersion: 5.0.2
elementType: O O O C C C C C C C C C C C C C C C C C C C C C C C H H H H H H H H H H H H H H H H H H H H H H H H H H
charge: 0
multiplicity: 1
keywords: wb97x-d3
keywords: def2-TZVPP
keywords: def2/J RIJCOSX
keywords: DEFGRID2
keywords: scfconv7
keywords: smallprint printgap noloewdin
keywords: NOSOSCF
formula: C23H26O3
InChI: InChI=1/C23H26O3/c1-16(2)13-20-21(23(20,3)4)22(24)25-15-17-9-8-12-19(14-17)26-18-10-6-5-7-11-18/h5-14,20-21H,15H2,1-4H3
52 atoms
O  0.046041 -2.161596 -1.159797
O  -0.449502 -2.886228 0.898176
O  2.175068 2.648205 -0.878502
C  -3.178167 -3.604229 -0.497568
C  -3.327038 -2.35985 0.326036
C  -2.199525 -2.457215 -0.676614
C  -4.127794 -3.847625 -1.646297
C  -2.757715 -4.876246 0.19677
C  -4.413317 -1.383325 0.104792
C  -0.803361 -2.532324 -0.195925
C  -5.308215 -0.972312 1.005585
C  -6.353903 0.040156 0.644651
C  -5.371416 -1.457777 2.421841
C  1.435597 -2.131415 -0.836359
C  1.809269 -0.873927 -0.103834
C  1.863888 0.328533 -0.798655
C  2.096635 -0.892945 1.254781
C  2.198941 1.501865 -0.141531
C  2.439245 0.283805 1.903186
C  2.491023 1.486572 1.217453
C  3.062542 3.650767 -0.619404
C  4.416295 3.404696 -0.422465
C  2.575582 4.949394 -0.617168
C  5.276681 4.471389 -0.215999
C  3.449256 6.007707 -0.418996
C  4.800313 5.774692 -0.211667
H  -2.997265 -2.472188 1.353453
H  -2.321868 -1.893985 -1.595325
H  -5.054503 -4.29842 -1.28694
H  -3.683302 -4.532123 -2.370652
H  -4.39411 -2.934896 -2.177358
H  -2.096976 -4.699603 1.041368
H  -2.245977 -5.548027 -0.495421
H  -3.641571 -5.398739 0.56719
H  -4.477548 -0.957726 -0.892512
H  -6.284894 0.922626 1.285963
H  -7.359358 -0.366322 0.782042
H  -6.26576 0.371841 -0.389268
H  -6.347066 -1.904695 2.627995
H  -5.25708 -0.627186 3.122317
H  -4.615576 -2.201814 2.662462
H  1.942689 -2.175285 -1.800458
H  1.720178 -3.015613 -0.263525
H  1.64205 0.363825 -1.858612
H  2.036692 -1.821957 1.805085
H  2.658157 0.269913 2.9626
H  2.750069 2.399779 1.73733
H  4.795294 2.390836 -0.434373
H  1.519298 5.122069 -0.775772
H  6.33056 4.279286 -0.063708
H  3.067111 7.019912 -0.419555
H  5.478394 6.601871 -0.05177
totalener: -1117.84808280 hartree
nucrepener: 2151.72485427 hartree
electener: -3269.57293707 hartree
oneelecener: -5792.32403870 hartree
twoeener: 2522.75110163 hartree
kineticenergy: 1112.86215580 hartree
xcener: -110.232432035146 hartree
chargesum: 0.0000000
charge: -0.265354 -0.401674 -0.299246 0.102711 0.036884 -0.124947 -0.237022 -0.265299 -0.186671 0.373897 -0.043099 -0.205978 -0.237300 0.051376 0.003607 -0.239302 -0.114937 0.225686 -0.120425 -0.159959 0.236858 -0.161257 -0.204750 -0.116050 -0.093941 -0.142974 0.089668 0.070443 0.090429 0.090691 0.071239 0.101273 0.083240 0.084699 0.073491 0.084757 0.083108 0.076962 0.083746 0.087551 0.082714 0.110280 0.103309 0.111183 0.116981 0.126176 0.132935 0.132568 0.125222 0.126397 0.125078 0.125020
qa: -0.2654 -0.4017 -0.2992 0.1027 0.0369 -0.1249 -0.2370 -0.2653 -0.1867 0.3739 -0.0431 -0.2060 -0.2373 0.0514 0.0036 -0.2393 -0.1149 0.2257 -0.1204 -0.1600 0.2369 -0.1613 -0.2048 -0.1160 -0.0939 -0.1430 0.0897 0.0704 0.0904 0.0907 0.0712 0.1013 0.0832 0.0847 0.0735 0.0848 0.0831 0.0770 0.0837 0.0876 0.0827 0.1103 0.1033 0.1112 0.1170 0.1262 0.1329 0.1326 0.1252 0.1264 0.1251 0.1250
va: 2.1303 2.1013 2.1037 3.7282 3.7750 3.9087 3.9122 3.9116 3.8983 4.2072 3.8055 3.9366 3.9482 3.8599 3.6803 4.0827 3.9587 3.8567 3.9675 3.9378 3.8168 3.9456 4.0360 3.9455 3.9347 3.9586 1.0361 1.0403 1.0052 1.0047 1.0107 1.0225 1.0028 1.0014 1.0201 0.9981 0.9983 1.0120 0.9995 0.9991 1.0143 0.9933 1.0120 1.0267 1.0227 1.0011 1.0033 1.0039 1.0139 1.0000 0.9990 1.0005
dispcorr: -0.022502536 hartree
energy: -1117.870585335498
dipole: -30.74205 30.68674 -0.05531 -14.24688 14.43278 0.18589 4.25664 -4.36779 -0.11115
magnitude: 0.22354 au
magnitude: 0.56820 debye
