program: Orca
programVersion: 5.0.2
elementType: O O O C C C C C C C C C C C C C C C C C C C C C C C H H H H H H H H H H H H H H H H H H H H H H H H H H
charge: 0
multiplicity: 1
keywords: wb97x-d3
keywords: def2-TZVPP
keywords: def2/J RIJCOSX
keywords: DEFGRID2
keywords: scfconv7
keywords: smallprint printgap noloewdin
keywords: NOSOSCF
formula: C23H26O3
InChI: InChI=1/C23H26O3/c1-16(2)13-20-21(23(20,3)4)22(24)25-15-17-9-8-12-19(14-17)26-18-10-6-5-7-11-18/h5-14,20-21H,15H2,1-4H3
52 atoms
O  0.737787 -2.579211 -1.054319
O  0.31191 -2.266966 1.119826
O  2.812656 1.96035 -0.764791
C  -2.6720 -2.062542 0.138095
C  -2.098245 -0.691037 0.295759
C  -1.346432 -1.7172 -0.519982
C  -3.822196 -2.275392 -0.816102
C  -2.720126 -2.971094 1.341316
C  -2.62957 0.520344 -0.379966
C  -0.045062 -2.209744 -0.025904
C  -3.777963 1.130434 -0.086337
C  -4.191044 2.382017 -0.799829
C  -4.725965 0.649902 0.969501
C  2.08748 -2.889245 -0.752667
C  2.888593 -1.669443 -0.379575
C  2.486451 -0.404505 -0.778995
C  4.057158 -1.809613 0.360783
C  3.220152 0.709157 -0.397171
C  4.806593 -0.695395 0.699941
C  4.385972 0.57587 0.336995
C  1.59458 2.410154 -0.347981
C  0.921601 1.886649 0.751442
C  1.048993 3.469198 -1.063217
C  -0.295531 2.436573 1.125095
C  -0.16545 4.009493 -0.67161
C  -0.845483 3.497758 0.423708
H  -1.647048 -0.509086 1.26899
H  -1.396911 -1.596893 -1.59691
H  -4.776161 -2.117124 -0.309433
H  -3.816686 -3.297964 -1.197279
H  -3.788038 -1.596453 -1.66697
H  -2.690566 -4.020032 1.040415
H  -3.657348 -2.8131 1.879503
H  -1.902852 -2.797687 2.036392
H  -1.991494 0.9635 -1.138666
H  -5.14062 2.243816 -1.323284
H  -3.445704 2.699667 -1.527771
H  -4.343175 3.204227 -0.095299
H  -4.387598 -0.261886 1.457643
H  -5.71683 0.46145 0.548678
H  -4.859831 1.41183 1.74201
H  2.481179 -3.338703 -1.665948
H  2.151411 -3.636159 0.042425
H  1.589512 -0.265883 -1.369542
H  4.376727 -2.792105 0.686148
H  5.713595 -0.812408 1.278042
H  4.946781 1.455033 0.624709
H  1.330264 1.057682 1.314285
H  1.58327 3.864805 -1.917017
H  -0.81881 2.023767 1.977407
H  -0.582446 4.836138 -1.23199
H  -1.79729 3.915023 0.722652
totalener: -1117.84508065 hartree
nucrepener: 2361.36032605 hartree
electener: -3479.20540671 hartree
oneelecener: -6211.51725499 hartree
twoeener: 2732.31184829 hartree
kineticenergy: 1112.86879368 hartree
xcener: -110.238649708082 hartree
chargesum: -0.0000000
charge: -0.279439 -0.375363 -0.302363 0.069392 -0.062842 -0.015756 -0.252890 -0.257408 -0.183125 0.287075 -0.009256 -0.227182 -0.257647 0.060772 0.074439 -0.212979 -0.184376 0.221517 -0.094200 -0.189723 0.261243 -0.161440 -0.206377 -0.113398 -0.097669 -0.168084 0.095609 0.085433 0.082830 0.098887 0.086304 0.087894 0.078688 0.103384 0.096283 0.097867 0.083176 0.079453 0.085420 0.092329 0.095876 0.109497 0.104300 0.129735 0.105652 0.124539 0.124970 0.136130 0.123355 0.125761 0.122628 0.121078
qa: -0.2794 -0.3754 -0.3024 0.0694 -0.0628 -0.0158 -0.2529 -0.2574 -0.1831 0.2871 -0.0093 -0.2272 -0.2576 0.0608 0.0744 -0.2130 -0.1844 0.2215 -0.0942 -0.1897 0.2612 -0.1614 -0.2064 -0.1134 -0.0977 -0.1681 0.0956 0.0854 0.0828 0.0989 0.0863 0.0879 0.0787 0.1034 0.0963 0.0979 0.0832 0.0795 0.0854 0.0923 0.0959 0.1095 0.1043 0.1297 0.1057 0.1245 0.1250 0.1361 0.1234 0.1258 0.1226 0.1211
va: 2.1138 2.1181 2.1099 3.8284 3.8084 3.7750 3.9016 3.8978 3.8274 4.2488 3.6779 3.9339 3.9398 3.8634 3.6410 3.9948 4.0315 3.8310 3.9379 4.0529 3.7962 3.8716 4.0268 3.8970 3.9387 3.9332 1.0252 1.0330 1.0028 1.0063 1.0078 1.0032 1.0037 1.0229 1.0083 1.0029 1.0111 0.9984 1.0084 0.9974 1.0044 0.9870 1.0096 1.0194 1.0103 0.9995 1.0106 1.0112 1.0146 1.0005 0.9992 0.9966
dispcorr: -0.029855310 hartree
energy: -1117.874935962412
dipole: -30.99440 30.44840 -0.54600 -1.90130 1.69266 -0.20864 2.62333 -2.87902 -0.25569
magnitude: 0.63798 au
magnitude: 1.62162 debye
