program: Orca
programVersion: 5.0.2
elementType: O O O C C C C C C C C C C C C C C C C C C C C C C C H H H H H H H H H H H H H H H H H H H H H H H H H H
charge: 0
multiplicity: 1
keywords: wb97x-d3
keywords: def2-TZVPP
keywords: def2/J RIJCOSX
keywords: DEFGRID2
keywords: scfconv7
keywords: smallprint printgap noloewdin
keywords: NOSOSCF
formula: C23H26O3
InChI: InChI=1/C23H26O3/c1-16(2)13-20-21(23(20,3)4)22(24)25-15-17-9-8-12-19(14-17)26-18-10-6-5-7-11-18/h5-14,20-21H,15H2,1-4H3
52 atoms
O  0.186035 -1.417452 -1.374983
O  -0.096516 -2.865323 0.306707
O  2.829924 2.526712 0.897805
C  -3.103393 -2.669669 -0.546921
C  -2.858686 -1.803055 0.649884
C  -1.970898 -1.656799 -0.560293
C  -4.277989 -2.347474 -1.438345
C  -2.818704 -4.148324 -0.449151
C  -3.765971 -0.690544 1.030213
C  -0.552683 -2.063808 -0.465116
C  -4.835976 -0.816684 1.815719
C  -5.681433 0.365295 2.181361
C  -5.271357 -2.12435 2.40347
C  1.591395 -1.659586 -1.355722
C  2.271935 -0.920222 -0.238097
C  2.23189 0.470536 -0.221182
C  2.926613 -1.604054 0.775552
C  2.860701 1.167525 0.800186
C  3.550027 -0.898439 1.79448
C  3.524635 0.484788 1.81215
C  2.727714 3.291497 -0.227808
C  3.573645 3.109304 -1.315539
C  1.780042 4.303367 -0.235873
C  3.454625 3.942235 -2.416353
C  1.680328 5.138786 -1.338516
C  2.509201 4.958281 -2.435025
H  -2.376558 -2.314752 1.478705
H  -2.145542 -0.787083 -1.184888
H  -4.122193 -2.752108 -2.439985
H  -4.451938 -1.276272 -1.531565
H  -5.192036 -2.790431 -1.037804
H  -2.016643 -4.380833 0.246352
H  -2.548944 -4.560557 -1.423645
H  -3.716954 -4.670131 -0.112278
H  -3.519219 0.296988 0.65072
H  -6.718696 0.218266 1.869975
H  -5.319828 1.284816 1.72265
H  -5.699836 0.515985 3.263729
H  -6.316679 -2.32938 2.159789
H  -5.207543 -2.09976 3.494567
H  -4.676457 -2.96583 2.053315
H  1.943526 -1.300233 -2.323226
H  1.800849 -2.729228 -1.295835
H  1.704841 1.00318 -1.003711
H  2.934013 -2.685691 0.778181
H  4.058122 -1.43146 2.587066
H  4.007204 1.041816 2.604296
H  4.319246 2.324589 -1.301444
H  1.132405 4.43323 0.621148
H  4.113233 3.798799 -3.262795
H  0.941621 5.929375 -1.34097
H  2.422902 5.60629 -3.296595
totalener: -1117.84690602 hartree
nucrepener: 2200.67091031 hartree
electener: -3318.51781634 hartree
oneelecener: -5890.24037804 hartree
twoeener: 2571.72256170 hartree
kineticenergy: 1112.86440187 hartree
xcener: -110.232172331293 hartree
chargesum: 0.0000000
charge: -0.271959 -0.392783 -0.300487 0.093996 -0.031392 -0.109134 -0.241708 -0.272528 -0.183676 0.364451 -0.030713 -0.211842 -0.234991 0.060540 -0.003035 -0.209765 -0.130621 0.245461 -0.087873 -0.214557 0.242751 -0.169791 -0.200773 -0.112736 -0.096263 -0.142324 0.107924 0.076810 0.093632 0.080828 0.085794 0.104955 0.087747 0.081377 0.089345 0.083435 0.078368 0.086605 0.083643 0.096203 0.081215 0.111263 0.098898 0.120015 0.109987 0.123026 0.124764 0.132388 0.125589 0.127262 0.125091 0.125584
qa: -0.2720 -0.3928 -0.3005 0.0940 -0.0314 -0.1091 -0.2417 -0.2725 -0.1837 0.3645 -0.0307 -0.2118 -0.2350 0.0605 -0.0030 -0.2098 -0.1306 0.2455 -0.0879 -0.2146 0.2428 -0.1698 -0.2008 -0.1127 -0.0963 -0.1423 0.1079 0.0768 0.0936 0.0808 0.0858 0.1050 0.0877 0.0814 0.0893 0.0834 0.0784 0.0866 0.0836 0.0962 0.0812 0.1113 0.0989 0.1200 0.1100 0.1230 0.1248 0.1324 0.1256 0.1273 0.1251 0.1256
va: 2.1237 2.1112 2.1092 3.7091 3.8173 3.8823 3.9067 3.9049 3.8535 4.2259 3.7374 3.9397 3.9392 3.8696 3.7173 3.9349 3.9780 3.8166 3.9485 4.0315 3.8188 3.9596 4.0399 3.9404 3.9315 3.9604 1.0250 1.0362 1.0052 1.0076 1.0036 1.0224 1.0032 1.0015 1.0133 0.9990 1.0108 0.9976 1.0005 1.0013 1.0112 0.9905 1.0123 1.0206 1.0189 0.9997 1.0129 1.0038 1.0134 0.9997 0.9992 1.0005
dispcorr: -0.023646572 hartree
energy: -1117.870552596559
dipole: -32.90655 32.47317 -0.43338 -12.22656 12.46921 0.24265 1.88642 -2.44439 -0.55797
magnitude: 0.74701 au
magnitude: 1.89876 debye
