program: Orca
programVersion: 5.0.2
elementType: O O O C C C C C C C C C C C C C C C C C C C C C C C H H H H H H H H H H H H H H H H H H H H H H H H H H
charge: 0
multiplicity: 1
keywords: wb97x-d3
keywords: def2-TZVPP
keywords: def2/J RIJCOSX
keywords: DEFGRID2
keywords: scfconv7
keywords: smallprint printgap noloewdin
keywords: NOSOSCF
formula: C23H26O3
InChI: InChI=1/C23H26O3/c1-16(2)13-20-21(23(20,3)4)22(24)25-15-17-9-8-12-19(14-17)26-18-10-6-5-7-11-18/h5-14,20-21H,15H2,1-4H3
52 atoms
O  0.055071 -2.097024 -0.247151
O  0.346985 -1.768995 1.942669
O  3.378254 1.701907 -0.761805
C  -2.123372 0.080738 -0.037864
C  -2.739217 -1.286561 -0.035057
C  -1.642293 -0.965176 0.952327
C  -2.907653 1.222511 0.563503
C  -1.295034 0.508572 -1.223925
C  -4.116164 -1.536851 0.458619
C  -0.321129 -1.631895 0.954843
C  -5.201979 -1.613285 -0.311928
C  -6.554568 -1.891838 0.269705
C  -5.171844 -1.43395 -1.79931
C  1.32063 -2.736391 -0.318884
C  2.483054 -1.793002 -0.163245
C  2.377248 -0.465869 -0.548839
C  3.692331 -2.265652 0.332411
C  3.460942 0.387925 -0.400281
C  4.781434 -1.41583 0.43639
C  4.672157 -0.079463 0.083974
C  2.273441 2.419108 -0.406717
C  1.799959 3.351278 -1.319527
C  1.657961 2.271961 0.831949
C  0.712375 4.144762 -0.987746
C  0.568728 3.06929 1.147391
C  0.088611 4.006114 0.243019
H  -2.424916 -1.916104 -0.861868
H  -1.969713 -0.785412 1.970952
H  -2.236535 2.033851 0.848809
H  -3.474173 0.925596 1.445101
H  -3.620642 1.617876 -0.162458
H  -0.536654 1.237656 -0.931333
H  -1.94107 0.994679 -1.958003
H  -0.804702 -0.322604 -1.72449
H  -4.236035 -1.67243 1.529636
H  -7.252938 -1.081606 0.04642
H  -6.518018 -2.015437 1.351057
H  -6.986653 -2.800521 -0.156397
H  -5.851198 -0.634212 -2.104095
H  -5.513365 -2.339114 -2.30777
H  -4.182626 -1.187978 -2.180192
H  1.339081 -3.194919 -1.309144
H  1.389722 -3.538062 0.420512
H  1.448571 -0.082795 -0.950685
H  3.781049 -3.297205 0.649931
H  5.719706 -1.789232 0.82458
H  5.509303 0.597676 0.188512
H  2.289053 3.452027 -2.279466
H  2.020039 1.542574 1.545145
H  0.34785 4.870987 -1.70221
H  0.094213 2.954247 2.113181
H  -0.761288 4.624824 0.497464
totalener: -1117.84421784 hartree
nucrepener: 2329.06015260 hartree
electener: -3446.90437044 hartree
oneelecener: -6146.71242445 hartree
twoeener: 2699.80805401 hartree
kineticenergy: 1112.86426297 hartree
xcener: -110.237971677588 hartree
chargesum: -0.0000000
charge: -0.283252 -0.350866 -0.301666 0.188445 -0.010435 -0.125603 -0.241097 -0.290925 -0.213951 0.325591 -0.024217 -0.212001 -0.236228 0.023910 0.083736 -0.191629 -0.183829 0.197182 -0.088081 -0.203518 0.213295 -0.181489 -0.123367 -0.093496 -0.161992 -0.145424 0.101030 0.078643 0.083022 0.081753 0.085080 0.051099 0.095243 0.094556 0.089235 0.083953 0.079554 0.085254 0.084796 0.092707 0.078220 0.104884 0.107601 0.155446 0.104139 0.123015 0.124787 0.123479 0.137015 0.123898 0.134741 0.127759
qa: -0.2833 -0.3509 -0.3017 0.1884 -0.0104 -0.1256 -0.2411 -0.2909 -0.2140 0.3256 -0.0242 -0.2120 -0.2362 0.0239 0.0837 -0.1916 -0.1838 0.1972 -0.0881 -0.2035 0.2133 -0.1815 -0.1234 -0.0935 -0.1620 -0.1454 0.1010 0.0786 0.0830 0.0818 0.0851 0.0511 0.0952 0.0946 0.0892 0.0840 0.0796 0.0853 0.0848 0.0927 0.0782 0.1049 0.1076 0.1554 0.1041 0.1230 0.1248 0.1235 0.1370 0.1239 0.1347 0.1278
va: 2.0906 2.1513 2.1103 3.5610 3.8041 3.9275 3.9092 3.9157 3.8754 4.2712 3.7367 3.9420 3.9465 3.8851 3.6398 3.9456 4.0372 3.8845 3.9478 4.0415 3.8302 3.9961 3.8570 3.9282 3.9001 3.8924 1.0198 1.0355 1.0185 1.0097 1.0060 1.0222 1.0103 1.0108 1.0154 0.9986 1.0111 0.9977 1.0004 1.0005 1.0118 0.9888 1.0081 0.9883 1.0102 0.9995 1.0121 1.0140 1.0074 0.9990 0.9990 1.0000
dispcorr: -0.028973117 hartree
energy: -1117.873190960968
dipole: -32.16298 31.38753 -0.77545 -1.15006 1.11269 -0.03737 -4.46675 3.80470 -0.66205
magnitude: 1.02031 au
magnitude: 2.59343 debye
