program: Orca
programVersion: 5.0.2
elementType: O O O C C C C C C C C C C C C C C C C C C C C C C C H H H H H H H H H H H H H H H H H H H H H H H H H H
charge: 0
multiplicity: 1
keywords: wb97x-d3
keywords: def2-TZVPP
keywords: def2/J RIJCOSX
keywords: DEFGRID2
keywords: scfconv7
keywords: smallprint printgap noloewdin
keywords: NOSOSCF
formula: C23H26O3
InChI: InChI=1/C23H26O3/c1-16(2)13-20-21(23(20,3)4)22(24)25-15-17-9-8-12-19(14-17)26-18-10-6-5-7-11-18/h5-14,20-21H,15H2,1-4H3
52 atoms
O  0.444511 -2.586486 -0.40563
O  -0.122235 -1.715711 1.578992
O  2.973167 2.043675 0.521732
C  -3.048271 -2.07768 0.646386
C  -2.59836 -0.714659 0.235108
C  -1.762502 -1.92139 -0.145747
C  -4.185705 -2.715022 -0.118057
C  -3.036047 -2.456811 2.107039
C  -3.347855 0.073343 -0.774543
C  -0.422738 -2.05654 0.464066
C  -2.892118 0.590903 -1.917125
C  -3.800775 1.369915 -2.821596
C  -1.482426 0.464306 -2.409506
C  1.815987 -2.694914 -0.009302
C  2.591105 -1.474474 -0.420733
C  2.444705 -0.28573 0.28573
C  3.43575 -1.514089 -1.524158
C  3.104779 0.858213 -0.139009
C  4.125028 -0.375981 -1.915511
C  3.954235 0.818808 -1.235661
C  1.731444 2.435432 0.936385
C  0.594163 2.224456 0.165686
C  1.641844 3.097378 2.151779
C  -0.636055 2.664301 0.628127
C  0.407141 3.545283 2.596466
C  -0.737001 3.324317 1.844509
H  -2.164612 -0.127513 1.042729
H  -1.819887 -2.239816 -1.180146
H  -4.190286 -2.432732 -1.170832
H  -5.147086 -2.419001 0.306723
H  -4.122703 -3.803017 -0.062359
H  -3.999036 -2.200526 2.553834
H  -2.259112 -1.949864 2.671806
H  -2.894848 -3.532246 2.229848
H  -4.389555 0.257469 -0.522721
H  -3.854429 0.910256 -3.811837
H  -3.429007 2.386634 -2.971393
H  -4.814402 1.43714 -2.428257
H  -1.06708 1.452905 -2.622424
H  -1.448059 -0.088509 -3.352017
H  -0.819036 -0.032225 -1.706225
H  2.194837 -3.577132 -0.524958
H  1.891399 -2.867917 1.064892
H  1.810232 -0.250133 1.161509
H  3.556847 -2.435764 -2.0795
H  4.787919 -0.413279 -2.769709
H  4.470911 1.717044 -1.547029
H  0.663831 1.717536 -0.787758
H  2.535601 3.256387 2.740429
H  -1.520197 2.484734 0.028721
H  0.341174 4.060099 3.545979
H  -1.69929 3.665459 2.201344
totalener: -1117.84610434 hartree
nucrepener: 2358.26862138 hartree
electener: -3476.11472572 hartree
oneelecener: -6205.28632429 hartree
twoeener: 2729.17159857 hartree
kineticenergy: 1112.85133031 hartree
xcener: -110.233507236196 hartree
chargesum: 0.0000000
charge: -0.264075 -0.405565 -0.303432 0.116827 -0.021961 -0.087867 -0.263613 -0.259838 -0.250692 0.334214 0.000046 -0.210852 -0.259241 0.050996 0.001286 -0.187806 -0.188173 0.233543 -0.083219 -0.213868 0.248847 -0.163437 -0.216086 -0.107511 -0.075921 -0.162086 0.102266 0.099390 0.084428 0.087589 0.093134 0.080319 0.105384 0.082897 0.092056 0.087235 0.087797 0.079000 0.095343 0.108697 0.083112 0.095368 0.117633 0.165256 0.106608 0.124637 0.125579 0.128338 0.122552 0.140695 0.122834 0.121336
qa: -0.2641 -0.4056 -0.3034 0.1168 -0.0220 -0.0879 -0.2636 -0.2598 -0.2507 0.3342 0.0000 -0.2109 -0.2592 0.0510 0.0013 -0.1878 -0.1882 0.2335 -0.0832 -0.2139 0.2488 -0.1634 -0.2161 -0.1075 -0.0759 -0.1621 0.1023 0.0994 0.0844 0.0876 0.0931 0.0803 0.1054 0.0829 0.0921 0.0872 0.0878 0.0790 0.0953 0.1087 0.0831 0.0954 0.1176 0.1653 0.1066 0.1246 0.1256 0.1283 0.1226 0.1407 0.1228 0.1213
va: 2.1217 2.0792 2.1140 3.7832 3.7897 3.8509 3.9069 3.9005 3.8498 4.1729 3.7276 3.9381 3.9265 3.8637 3.7115 3.8761 4.0286 3.8381 3.9360 4.0558 3.8639 3.9121 4.0490 3.8891 3.9260 4.0047 1.0221 1.0237 1.0062 1.0038 1.0057 1.0014 1.0234 1.0026 1.0144 0.9997 0.9990 1.0104 0.9946 1.0051 1.0067 0.9989 1.0134 1.0153 1.0124 0.9992 1.0124 1.0041 1.0141 0.9925 0.9982 1.0028
dispcorr: -0.028718033 hartree
energy: -1117.874822374566
dipole: -25.63370 25.17696 -0.45674 -4.53686 4.25059 -0.28627 -7.65273 6.90346 -0.74926
magnitude: 0.92301 au
magnitude: 2.34612 debye
