program: Orca
programVersion: 5.0.2
elementType: O O O C C C C C C C C C C C C C C C C C C C C C C C H H H H H H H H H H H H H H H H H H H H H H H H H H
charge: 0
multiplicity: 1
keywords: wb97x-d3
keywords: def2-TZVPP
keywords: def2/J RIJCOSX
keywords: DEFGRID2
keywords: scfconv7
keywords: smallprint printgap noloewdin
keywords: NOSOSCF
formula: C23H26O3
InChI: InChI=1/C23H26O3/c1-16(2)13-20-21(23(20,3)4)22(24)25-15-17-9-8-12-19(14-17)26-18-10-6-5-7-11-18/h5-14,20-21H,15H2,1-4H3
52 atoms
O  0.425205 -2.033102 -1.246728
O  -0.026542 -3.028813 0.708659
O  2.416598 2.059776 1.043543
C  -2.990985 -2.82326 -0.345703
C  -2.730275 -1.725051 0.628866
C  -1.769315 -1.935851 -0.521921
C  -4.073404 -2.62957 -1.381111
C  -2.844663 -4.255443 0.104811
C  -3.581937 -0.50845 0.672304
C  -0.397125 -2.408556 -0.250641
C  -3.141969 0.749584 0.713562
C  -4.093762 1.906582 0.743571
C  -1.693275 1.124154 0.737305
C  1.798274 -2.349162 -1.120214
C  2.569278 -1.35849 -0.287386
C  2.078213 -0.085717 -0.028586
C  3.828351 -1.719396 0.177231
C  2.852768 0.819131 0.688369
C  4.592796 -0.809544 0.887831
C  4.114952 0.464749 1.142311
C  1.567803 2.794009 0.274912
C  1.566219 2.761553 -1.114927
C  0.718478 3.658595 0.953916
C  0.690783 3.579992 -1.813298
C  -0.140799 4.479332 0.242799
C  -0.168392 4.438246 -1.143618
H  -2.341626 -2.060499 1.587958
H  -1.839962 -1.222586 -1.335176
H  -5.043996 -2.933985 -0.983746
H  -3.872781 -3.238864 -2.263839
H  -4.15978 -1.592208 -1.703821
H  -2.087183 -4.381958 0.873982
H  -2.585316 -4.904567 -0.733823
H  -3.794504 -4.608784 0.510728
H  -4.655128 -0.677971 0.685644
H  -3.91035 2.582489 -0.095043
H  -3.962365 2.498218 1.652552
H  -5.133753 1.586405 0.698452
H  -1.032934 0.270179 0.865465
H  -1.493181 1.815713 1.557686
H  -1.40377 1.650785 -0.176359
H  2.1830 -2.340777 -2.142188
H  1.934731 -3.357232 -0.72216
H  1.094405 0.198426 -0.377627
H  4.2091 -2.716054 -0.009666
H  5.571368 -1.093806 1.250975
H  4.70269 1.180804 1.700914
H  2.242395 2.111286 -1.653855
H  0.739407 3.680172 2.035653
H  0.69075 3.548519 -2.894936
H  -0.800093 5.149102 0.779185
H  -0.845715 5.07447 -1.696849
totalener: -1117.84562860 hartree
nucrepener: 2325.18770771 hartree
electener: -3443.03333631 hartree
oneelecener: -6138.98965354 hartree
twoeener: 2695.95631723 hartree
kineticenergy: 1112.86315558 hartree
xcener: -110.239015824367 hartree
chargesum: -0.0000000
charge: -0.278867 -0.371485 -0.296564 0.118450 0.003892 -0.121553 -0.268060 -0.261699 -0.236509 0.308498 0.016369 -0.221876 -0.246892 0.046516 0.076733 -0.281702 -0.215386 0.347243 -0.068370 -0.240396 0.314989 -0.212534 -0.268456 -0.096200 -0.068796 -0.166275 0.105927 0.091955 0.089034 0.090786 0.086298 0.102521 0.083700 0.083096 0.092226 0.083329 0.086610 0.079618 0.089061 0.093485 0.093548 0.110882 0.104327 0.128001 0.106212 0.123544 0.122706 0.136493 0.129143 0.127295 0.124617 0.124516
qa: -0.2789 -0.3715 -0.2966 0.1185 0.0039 -0.1216 -0.2681 -0.2617 -0.2365 0.3085 0.0164 -0.2219 -0.2469 0.0465 0.0767 -0.2817 -0.2154 0.3472 -0.0684 -0.2404 0.3150 -0.2125 -0.2685 -0.0962 -0.0688 -0.1663 0.1059 0.0920 0.0890 0.0908 0.0863 0.1025 0.0837 0.0831 0.0922 0.0833 0.0866 0.0796 0.0891 0.0935 0.0935 0.1109 0.1043 0.1280 0.1062 0.1235 0.1227 0.1365 0.1291 0.1273 0.1246 0.1245
va: 2.1094 2.1271 2.1256 3.7539 3.7858 3.8268 3.9052 3.9063 3.8953 4.2098 3.7380 3.9419 3.9440 3.8774 3.7179 3.9806 4.0520 3.7051 3.9313 4.0577 3.7267 3.9453 3.9759 3.9209 3.8753 3.9593 1.0240 1.0285 1.0025 1.0063 1.0060 1.0214 1.0019 1.0020 1.0091 1.0000 0.9992 1.0108 1.0099 1.0035 0.9941 0.9839 1.0154 1.0111 1.0103 0.9993 1.0152 1.0027 1.0155 0.9997 0.9992 1.0016
dispcorr: -0.027988057 hartree
energy: -1117.873616658513
dipole: -24.26713 24.01551 -0.25162 -3.46851 3.82549 0.35698 -2.77099 2.00890 -0.76209
magnitude: 0.87837 au
magnitude: 2.23263 debye
