program: Orca
programVersion: 5.0.2
elementType: O O O C C C C C C C C C C C C C C C C C C C C C C C H H H H H H H H H H H H H H H H H H H H H H H H H H
charge: 0
multiplicity: 1
keywords: wb97x-d3
keywords: def2-TZVPP
keywords: def2/J RIJCOSX
keywords: DEFGRID2
keywords: scfconv7
keywords: smallprint printgap noloewdin
keywords: NOSOSCF
formula: C23H26O3
InChI: InChI=1/C23H26O3/c1-16(2)13-20-21(23(20,3)4)22(24)25-15-17-9-8-12-19(14-17)26-18-10-6-5-7-11-18/h5-14,20-21H,15H2,1-4H3
52 atoms
O  0.10714 -2.350293 0.305225
O  -0.355561 -1.237596 -1.580744
O  3.222099 1.499339 1.299532
C  -2.31756 0.236853 0.450052
C  -3.06254 -0.60353 -0.531123
C  -1.915031 -1.216578 0.238252
C  -2.958497 0.537731 1.783704
C  -1.440138 1.354827 -0.053953
C  -4.462734 -1.035225 -0.282458
C  -0.668606 -1.572678 -0.470499
C  -4.971763 -2.235775 -0.561611
C  -6.41102 -2.553744 -0.289279
C  -4.176481 -3.351737 -1.166483
C  1.342495 -2.780363 -0.234007
C  2.428234 -1.737528 -0.187467
C  2.299606 -0.566313 0.541467
C  3.617627 -1.988911 -0.866202
C  3.346671 0.345644 0.573924
C  4.663287 -1.085066 -0.807598
C  4.53325 0.096357 -0.091064
C  2.351523 2.450501 0.856767
C  1.969454 2.566422 -0.474402
C  1.869797 3.345857 1.804682
C  1.105758 3.586097 -0.846505
C  1.008572 4.358305 1.4159
C  0.61999 4.485027 0.089594
H  -2.821284 -0.395325 -1.57123
H  -2.174677 -1.884416 1.051871
H  -3.600648 1.417963 1.710692
H  -2.195681 0.749925 2.534442
H  -3.567994 -0.287842 2.151047
H  -0.981438 1.135426 -1.014837
H  -0.640941 1.583016 0.653179
H  -2.032893 2.263306 -0.172052
H  -5.127212 -0.28375 0.135352
H  -6.5032 -3.406085 0.38838
H  -6.932725 -2.830479 -1.208559
H  -6.94038 -1.712189 0.155961
H  -4.650895 -3.704553 -2.085366
H  -4.13513 -4.21065 -0.491543
H  -3.156575 -3.064617 -1.410853
H  1.216329 -3.134127 -1.260699
H  1.632732 -3.636244 0.378186
H  1.392638 -0.346046 1.090104
H  3.726511 -2.898121 -1.445625
H  5.583941 -1.290985 -1.33705
H  5.338459 0.817491 -0.048153
H  2.330953 1.869151 -1.21849
H  2.175365 3.242667 2.837628
H  0.808447 3.669685 -1.883549
H  0.635229 5.050535 2.1592
H  -0.055087 5.275178 -0.209491
totalener: -1117.84608121 hartree
nucrepener: 2306.78435555 hartree
electener: -3424.63043676 hartree
oneelecener: -6102.36885751 hartree
twoeener: 2677.73842075 hartree
kineticenergy: 1112.85682967 hartree
xcener: -110.234905902795 hartree
chargesum: -0.0000000
charge: -0.276682 -0.365298 -0.302220 0.166661 -0.011877 -0.129998 -0.274931 -0.261706 -0.242992 0.306120 -0.006904 -0.211470 -0.224190 0.041373 0.064180 -0.156142 -0.184432 0.187272 -0.101590 -0.177051 0.229158 -0.142485 -0.195796 -0.138637 -0.088584 -0.154900 0.106550 0.089326 0.089892 0.092900 0.087195 0.100318 0.064130 0.088264 0.092520 0.083995 0.087349 0.078166 0.090058 0.087014 0.083198 0.107442 0.116438 0.122478 0.108293 0.125638 0.126689 0.129497 0.122602 0.127828 0.122779 0.122559
qa: -0.2767 -0.3653 -0.3022 0.1667 -0.0119 -0.1300 -0.2749 -0.2617 -0.2430 0.3061 -0.0069 -0.2115 -0.2242 0.0414 0.0642 -0.1561 -0.1844 0.1873 -0.1016 -0.1771 0.2292 -0.1425 -0.1958 -0.1386 -0.0886 -0.1549 0.1066 0.0893 0.0899 0.0929 0.0872 0.1003 0.0641 0.0883 0.0925 0.0840 0.0873 0.0782 0.0901 0.0870 0.0832 0.1074 0.1164 0.1225 0.1083 0.1256 0.1267 0.1295 0.1226 0.1278 0.1228 0.1226
va: 2.1139 2.1306 2.0966 3.7409 3.8217 3.8485 3.9030 3.8808 3.9017 4.1981 3.7410 3.9415 3.9388 3.8758 3.6626 4.0134 4.0195 3.8753 3.9352 4.0299 3.8032 3.8518 4.0065 3.9141 3.9323 3.9269 1.0268 1.0309 1.0016 1.0063 1.0053 1.0149 1.0069 1.0063 1.0099 0.9993 0.9986 1.0100 1.0023 1.0006 1.0158 1.0113 0.9860 1.0164 1.0089 0.9998 1.0098 1.0106 1.0153 1.0009 0.9988 1.0015
dispcorr: -0.027758798 hartree
energy: -1117.873840006161
dipole: -28.86840 28.47556 -0.39283 -5.12571 4.69187 -0.43383 -0.86997 1.03551 0.16554
magnitude: 0.60822 au
magnitude: 1.54598 debye
