program: Orca
programVersion: 5.0.2
elementType: O O O C C C C C C C C C C C C C C C C C C C C C C C H H H H H H H H H H H H H H H H H H H H H H H H H H
charge: 0
multiplicity: 1
keywords: wb97x-d3
keywords: def2-TZVPP
keywords: def2/J RIJCOSX
keywords: DEFGRID2
keywords: scfconv7
keywords: smallprint printgap noloewdin
keywords: NOSOSCF
formula: C23H26O3
InChI: InChI=1/C23H26O3/c1-16(2)13-20-21(23(20,3)4)22(24)25-15-17-9-8-12-19(14-17)26-18-10-6-5-7-11-18/h5-14,20-21H,15H2,1-4H3
52 atoms
O  0.137936 -2.19834 0.294633
O  -0.570239 -1.26509 -1.619447
O  3.277863 1.818606 0.767434
C  -2.31109 0.331345 0.502319
C  -3.153769 -0.592425 -0.31138
C  -1.911588 -1.130954 0.357526
C  -2.783765 0.734796 1.878374
C  -1.528508 1.412619 -0.199413
C  -4.501039 -1.024917 0.142283
C  -0.742861 -1.519757 -0.456845
C  -5.013671 -2.247488 -0.002416
C  -6.394507 -2.575629 0.47929
C  -4.276237 -3.380446 -0.648429
C  1.361025 -2.60893 -0.293432
C  2.505269 -1.693108 0.053558
C  2.315621 -0.333486 0.26159
C  3.788285 -2.224201 0.127689
C  3.408138 0.485456 0.517543
C  4.87033 -1.400601 0.39401
C  4.690059 -0.04131 0.584908
C  2.340436 2.566587 0.117812
C  1.717301 3.567414 0.850832
C  2.046901 2.39714 -1.230425
C  0.802129 4.403966 0.230945
C  1.119842 3.232748 -1.833169
C  0.494666 4.238857 -1.11121
H  -3.046076 -0.463632 -1.386068
H  -2.05771 -1.730751 1.248703
H  -3.331249 -0.061189 2.383106
H  -3.440839 1.605105 1.820523
H  -1.934629 1.005276 2.507947
H  -2.149703 2.303319 -0.310111
H  -1.195333 1.121353 -1.192517
H  -0.648904 1.707269 0.376934
H  -5.12021 -0.261685 0.605753
H  -7.030944 -2.905258 -0.345522
H  -6.876902 -1.722367 0.954624
H  -6.373539 -3.395343 1.202012
H  -4.104642 -4.19071 0.065257
H  -3.31392 -3.08393 -1.059152
H  -4.867556 -3.806323 -1.462436
H  1.260008 -2.680988 -1.378793
H  1.562081 -3.609981 0.090907
H  1.325081 0.100058 0.227978
H  3.943509 -3.286325 -0.018184
H  5.865437 -1.82051 0.456388
H  5.527646 0.61088 0.793109
H  1.960148 3.688628 1.898428
H  2.532733 1.621551 -1.807806
H  0.322773 5.18511 0.806094
H  0.88903 3.094272 -2.881115
H  -0.226309 4.886872 -1.590761
totalener: -1117.84639134 hartree
nucrepener: 2302.77431305 hartree
electener: -3420.62070440 hartree
oneelecener: -6094.24680306 hartree
twoeener: 2673.62609866 hartree
kineticenergy: 1112.84859101 hartree
xcener: -110.235353299895 hartree
chargesum: 0.0000000
charge: -0.264031 -0.372397 -0.297039 0.177601 -0.008348 -0.132865 -0.280019 -0.295548 -0.244786 0.304189 -0.005641 -0.211354 -0.225259 0.055044 0.032359 -0.163880 -0.184432 0.247555 -0.084595 -0.217155 0.239411 -0.202923 -0.152445 -0.092994 -0.122954 -0.146830 0.106393 0.086158 0.086866 0.089890 0.095085 0.093800 0.109589 0.066982 0.092539 0.087103 0.078097 0.084063 0.087475 0.082736 0.089840 0.109943 0.100049 0.119282 0.104462 0.123531 0.124041 0.122438 0.132913 0.123366 0.128681 0.124014
qa: -0.2640 -0.3724 -0.2970 0.1776 -0.0083 -0.1329 -0.2800 -0.2955 -0.2448 0.3042 -0.0056 -0.2114 -0.2253 0.0550 0.0324 -0.1639 -0.1844 0.2476 -0.0846 -0.2172 0.2394 -0.2029 -0.1524 -0.0930 -0.1230 -0.1468 0.1064 0.0862 0.0869 0.0899 0.0951 0.0938 0.1096 0.0670 0.0925 0.0871 0.0781 0.0841 0.0875 0.0827 0.0898 0.1099 0.1000 0.1193 0.1045 0.1235 0.1240 0.1224 0.1329 0.1234 0.1287 0.1240
va: 2.1220 2.1223 2.1175 3.7211 3.8147 3.8569 3.9054 3.8916 3.9033 4.2488 3.7362 3.9420 3.9392 3.8835 3.7410 3.9620 3.9947 3.8283 3.9570 4.0360 3.8076 3.9926 3.9142 3.9107 3.8928 3.9086 1.0265 1.0328 1.0054 1.0013 1.0055 1.0055 1.0124 1.0013 1.0097 0.9988 1.0098 0.9990 1.0005 1.0169 1.0024 1.0126 0.9936 0.9832 1.0125 0.9999 1.0143 1.0156 1.0035 0.9998 1.0003 1.0015
dispcorr: -0.027589261 hartree
energy: -1117.873980605080
dipole: -28.66006 28.30937 -0.35069 -5.64980 5.37012 -0.27968 2.00892 -1.69179 0.31713
magnitude: 0.54934 au
magnitude: 1.39632 debye
