program: Orca
programVersion: 5.0.2
elementType: O O O C C C C C C C C C C C C C C C C C C C C C C C H H H H H H H H H H H H H H H H H H H H H H H H H H
charge: 0
multiplicity: 1
keywords: wb97x-d3
keywords: def2-TZVPP
keywords: def2/J RIJCOSX
keywords: DEFGRID2
keywords: scfconv7
keywords: smallprint printgap noloewdin
keywords: NOSOSCF
formula: C23H26O3
InChI: InChI=1/C23H26O3/c1-16(2)13-20-21(23(20,3)4)22(24)25-15-17-9-8-12-19(14-17)26-18-10-6-5-7-11-18/h5-14,20-21H,15H2,1-4H3
52 atoms
O  0.344927 -1.986872 -1.474416
O  0.076616 -3.032008 0.480875
O  1.986756 2.080529 1.107736
C  -2.975866 -2.933756 -0.365176
C  -2.667959 -1.882046 0.641742
C  -1.797169 -1.99883 -0.597088
C  -4.141843 -2.730998 -1.302495
C  -2.741517 -4.381864 -0.012802
C  -3.512517 -0.674819 0.833822
C  -0.393615 -2.414173 -0.444838
C  -3.036504 0.539564 1.12115
C  -3.94345 1.717737 1.300554
C  -1.573904 0.834694 1.258913
C  1.755647 -2.163893 -1.387081
C  2.385978 -1.257698 -0.363866
C  1.868073 0.011926 -0.130776
C  3.518445 -1.677131 0.325635
C  2.489298 0.85047 0.785601
C  4.130927 -0.828712 1.2359
C  3.62511 0.440692 1.46922
C  1.480452 2.916388 0.153716
C  1.963398 2.96183 -1.148446
C  0.474813 3.783465 0.562664
C  1.411673 3.866836 -2.044563
C  -0.059061 4.688935 -0.341423
C  0.399477 4.73083 -1.651002
H  -2.183893 -2.255065 1.541773
H  -1.958694 -1.249379 -1.363811
H  -4.001863 -3.308217 -2.21858
H  -4.274557 -1.687547 -1.589053
H  -5.071248 -3.069241 -0.839212
H  -2.462182 -4.960755 -0.895602
H  -3.660989 -4.816212 0.385259
H  -1.967234 -4.520092 0.738802
H  -4.58788 -0.806356 0.748372
H  -4.990702 1.462007 1.138761
H  -3.680133 2.520563 0.606268
H  -3.84946 2.137991 2.305332
H  -1.218402 1.409272 0.399091
H  -0.95782 -0.058818 1.341961
H  -1.384996 1.450578 2.141189
H  2.125241 -1.919661 -2.384004
H  2.011009 -3.207473 -1.191589
H  0.979984 0.345892 -0.653455
H  3.917123 -2.670099 0.157686
H  5.010904 -1.158375 1.772903
H  4.09761 1.10401 2.182608
H  2.760546 2.305347 -1.472547
H  0.113559 3.746181 1.582564
H  1.785471 3.894751 -3.059815
H  -0.844005 5.360123 -0.017479
H  -0.026018 5.431649 -2.356944
elementType: O C H
totalener: -1117.86816670 hartree
nucrepener: 2322.68088505 hartree
electener: -3440.54905174 hartree
oneelecener: -6134.95930146 hartree
twoeener: 2694.41024971 hartree
cpcmener: -0.02486790 hartree
kineticenergy: 1112.81215507 hartree
xcener: -110.231050043956 hartree
chargesum: -0.0000000
charge: -0.294356 -0.464870 -0.333357 0.154139 -0.008411 -0.073123 -0.286601 -0.278498 -0.309791 0.349854 0.021584 -0.230109 -0.276894 0.099642 0.035485 -0.276731 -0.231412 0.337495 -0.104014 -0.270315 0.323859 -0.210115 -0.293089 -0.141168 -0.102418 -0.195604 0.102117 0.090341 0.096780 0.092744 0.099061 0.098951 0.093624 0.092288 0.120947 0.089875 0.091858 0.095992 0.101340 0.089654 0.104481 0.120042 0.112953 0.145636 0.140408 0.157391 0.145574 0.154363 0.149103 0.158922 0.157024 0.157348
qa: -0.2944 -0.4649 -0.3334 0.1541 -0.0084 -0.0731 -0.2866 -0.2785 -0.3098 0.3499 0.0216 -0.2301 -0.2769 0.0996 0.0355 -0.2767 -0.2314 0.3375 -0.1040 -0.2703 0.3239 -0.2101 -0.2931 -0.1412 -0.1024 -0.1956 0.1021 0.0903 0.0968 0.0927 0.0991 0.0990 0.0936 0.0923 0.1209 0.0899 0.0919 0.0960 0.1013 0.0897 0.1045 0.1200 0.1130 0.1456 0.1404 0.1574 0.1456 0.1544 0.1491 0.1589 0.1570 0.1573
va: 2.1070 2.0348 2.0599 3.7087 3.8016 3.7679 3.9077 3.8918 3.9108 4.1832 3.6793 3.9308 3.9552 3.8028 3.6640 3.9422 3.9879 3.6209 3.8804 4.0472 3.6358 3.9052 3.9704 3.8916 3.8655 3.9196 1.0267 1.0330 1.0032 1.0018 0.9997 0.9990 1.0011 1.0184 1.0036 1.0066 0.9971 0.9970 0.9942 1.0112 1.0008 0.9911 1.0110 1.0088 1.0028 0.9887 1.0072 0.9983 1.0061 0.9901 0.9892 0.9907
dispcorr: -0.027683117 hartree
energy: -1117.895849812842
dipole: -22.63459 22.32827 -0.30632 -4.37198 4.87641 0.50443 -0.90889 -0.27109 -1.17999
magnitude: 1.31934 au
magnitude: 3.35349 debye
