program: Orca
programVersion: 5.0.2
elementType: O O O C C C C C C C C C C C C C C C C C C C C C C C H H H H H H H H H H H H H H H H H H H H H H H H H H
charge: 0
multiplicity: 1
keywords: wb97x-d3
keywords: def2-TZVPP
keywords: def2/J RIJCOSX
keywords: DEFGRID2
keywords: scfconv7
keywords: smallprint printgap noloewdin
keywords: NOSOSCF
formula: C23H26O3
InChI: InChI=1/C23H26O3/c1-16(2)13-20-21(23(20,3)4)22(24)25-15-17-9-8-12-19(14-17)26-18-10-6-5-7-11-18/h5-14,20-21H,15H2,1-4H3
52 atoms
O  0.353741 -2.08483 -1.365039
O  0.041467 -3.035698 0.631614
O  2.086901 2.11887 1.001047
C  -3.005248 -2.921152 -0.205066
C  -2.677723 -1.767371 0.67466
C  -1.804622 -2.047316 -0.53824
C  -4.157326 -2.798123 -1.173628
C  -2.822973 -4.320376 0.327912
C  -3.503221 -0.533869 0.730288
C  -0.407118 -2.461129 -0.331997
C  -3.020854 0.691724 0.950916
C  -3.920424 1.887298 1.016694
C  -1.562972 0.98148 1.131725
C  1.762491 -2.262796 -1.247642
C  2.380558 -1.326391 -0.244384
C  1.918285 -0.018656 -0.125403
C  3.442637 -1.758424 0.540515
C  2.527965 0.846263 0.773981
C  4.047377 -0.882801 1.430841
C  3.598535 0.421931 1.551105
C  1.560025 2.899427 0.011904
C  0.580939 3.805114 0.401411
C  2.002811 2.862895 -1.304768
C  0.031699 4.666541 -0.535657
C  1.435286 3.724096 -2.234038
C  0.448705 4.625436 -1.859224
H  -2.203172 -2.045035 1.613364
H  -1.949749 -1.388164 -1.386581
H  -4.024855 -3.483717 -2.012899
H  -4.255992 -1.792978 -1.584015
H  -5.101391 -3.05265 -0.687153
H  -3.752326 -4.655963 0.792843
H  -2.040856 -4.392391 1.080219
H  -2.586441 -5.022681 -0.473826
H  -4.576106 -0.654832 0.606435
H  -3.848164 2.379867 1.989955
H  -4.96545 1.626951 0.847815
H  -3.632872 2.634524 0.271914
H  -1.394286 1.561466 2.042599
H  -1.192205 1.592728 0.304794
H  -0.946738 0.086188 1.190676
H  2.14715 -2.050928 -2.246101
H  2.011092 -3.300442 -1.01532
H  1.082131 0.319154 -0.725252
H  3.793837 -2.779856 0.460765
H  4.874268 -1.220092 2.04225
H  4.063704 1.106418 2.249246
H  0.254068 3.831963 1.433429
H  2.78039 2.176165 -1.613827
H  -0.732287 5.368335 -0.226467
H  1.776957 3.688946 -3.260526
H  0.011743 5.292356 -2.590738
elementType: O C H
totalener: -1117.86805626 hartree
nucrepener: 2321.15540088 hartree
electener: -3439.02345714 hartree
oneelecener: -6131.92282610 hartree
twoeener: 2692.89936897 hartree
cpcmener: -0.02480837 hartree
kineticenergy: 1112.80886528 hartree
xcener: -110.230667325066 hartree
chargesum: -0.0000000
charge: -0.292841 -0.466669 -0.331191 0.159532 -0.017297 -0.088859 -0.288633 -0.278537 -0.294640 0.362473 0.011219 -0.231379 -0.263705 0.100949 0.036774 -0.300346 -0.229347 0.357849 -0.102333 -0.277924 0.338471 -0.300459 -0.223888 -0.098925 -0.135859 -0.195267 0.103288 0.091004 0.097801 0.092970 0.098482 0.094111 0.092139 0.097488 0.121146 0.095771 0.090134 0.091966 0.104175 0.097371 0.085022 0.120140 0.112733 0.145220 0.140214 0.157030 0.144796 0.148185 0.155916 0.156960 0.159088 0.157682
qa: -0.2928 -0.4667 -0.3312 0.1595 -0.0173 -0.0889 -0.2886 -0.2785 -0.2946 0.3625 0.0112 -0.2314 -0.2637 0.1009 0.0368 -0.3003 -0.2293 0.3578 -0.1023 -0.2779 0.3385 -0.3005 -0.2239 -0.0989 -0.1359 -0.1953 0.1033 0.0910 0.0978 0.0930 0.0985 0.0941 0.0921 0.0975 0.1211 0.0958 0.0901 0.0920 0.1042 0.0974 0.0850 0.1201 0.1127 0.1452 0.1402 0.1570 0.1448 0.1482 0.1559 0.1570 0.1591 0.1577
va: 2.1055 2.0352 2.0655 3.7019 3.8122 3.7829 3.9098 3.8883 3.8989 4.1722 3.6947 3.9290 3.9481 3.8022 3.6654 3.9419 3.9848 3.6101 3.8815 4.0394 3.6091 3.9745 3.9175 3.8547 3.8870 3.9208 1.0256 1.0331 1.0030 1.0015 1.0000 1.0008 1.0195 0.9995 1.0030 0.9966 1.0065 0.9976 1.0002 0.9974 1.0127 0.9911 1.0102 1.0092 1.0032 0.9889 1.0080 1.0072 0.9978 0.9891 0.9898 0.9906
dispcorr: -0.027572409 hartree
energy: -1117.895628664739
dipole: -22.95628 22.62286 -0.33342 -3.93179 4.43629 0.50451 -0.85642 -0.31874 -1.17516
magnitude: 1.32162 au
magnitude: 3.35930 debye
