program: Orca
programVersion: 5.0.2
elementType: O O O C C C C C C C C C C C C C C C C C C C C C C C H H H H H H H H H H H H H H H H H H H H H H H H H H
charge: 0
multiplicity: 1
keywords: wb97x-d3
keywords: def2-TZVPP
keywords: def2/J RIJCOSX
keywords: DEFGRID2
keywords: scfconv7
keywords: smallprint printgap noloewdin
keywords: NOSOSCF
formula: C23H26O3
InChI: InChI=1/C23H26O3/c1-16(2)13-20-21(23(20,3)4)22(24)25-15-17-9-8-12-19(14-17)26-18-10-6-5-7-11-18/h5-14,20-21H,15H2,1-4H3
52 atoms
O  0.082293 -2.178677 0.216189
O  -0.588396 -1.117155 -1.64129
O  3.308773 1.777749 0.772331
C  -2.363791 0.365154 0.536277
C  -3.205842 -0.543886 -0.293753
C  -1.942065 -1.085753 0.335142
C  -2.805925 0.713691 1.936702
C  -1.605901 1.479623 -0.142218
C  -4.525401 -1.044423 0.174253
C  -0.777427 -1.439759 -0.492434
C  -4.993159 -2.277953 -0.032831
C  -6.331836 -2.704395 0.486998
C  -4.233988 -3.33427 -0.775709
C  1.306803 -2.598605 -0.375286
C  2.459694 -1.710084 0.009296
C  2.29991 -0.343913 0.213803
C  3.723705 -2.27931 0.131804
C  3.406629 0.440598 0.515378
C  4.817922 -1.487159 0.444662
C  4.67011 -0.122397 0.632029
C  2.389131 2.561218 0.131002
C  1.775094 3.550784 0.886629
C  2.119924 2.438951 -1.227427
C  0.890968 4.428986 0.276743
C  1.222685 3.31559 -1.820325
C  0.606373 4.313369 -1.076781
H  -3.125696 -0.371811 -1.365211
H  -2.075017 -1.715482 1.207754
H  -3.309325 -0.113908 2.436917
H  -3.491597 1.56393 1.926406
H  -1.945773 0.993239 2.548315
H  -2.211662 2.388197 -0.139397
H  -1.359375 1.259088 -1.178634
H  -0.677647 1.705711 0.388037
H  -5.14999 -0.339114 0.715887
H  -6.828871 -1.912469 1.047553
H  -6.235021 -3.572285 1.145089
H  -6.993867 -3.00884 -0.327834
H  -3.950825 -4.151344 -0.105981
H  -3.327502 -2.962957 -1.250372
H  -4.858557 -3.779065 -1.554391
H  1.216131 -2.65412 -1.462328
H  1.482626 -3.611378 -0.011492
H  1.324713 0.121495 0.146129
H  3.851721 -3.345334 -0.011789
H  5.79803 -1.935336 0.543582
H  5.521324 0.500606 0.875907
H  1.996868 3.63652 1.943162
H  2.604537 1.676961 -1.824772
H  0.418749 5.202516 0.868549
H  1.012289 3.219161 -2.877824
H  -0.087803 4.995534 -1.549573
elementType: O C H
totalener: -1117.86856505 hartree
nucrepener: 2297.52134398 hartree
electener: -3415.38990903 hartree
oneelecener: -6084.65995765 hartree
twoeener: 2669.27004862 hartree
cpcmener: -0.02389335 hartree
kineticenergy: 1112.79150063 hartree
xcener: -110.227629944814 hartree
chargesum: -0.0000000
charge: -0.284262 -0.463018 -0.325884 0.192144 -0.013055 -0.121214 -0.293175 -0.311459 -0.298811 0.370014 -0.012949 -0.227884 -0.240903 0.078680 0.019545 -0.202425 -0.223441 0.279933 -0.109958 -0.256011 0.282554 -0.226810 -0.194935 -0.135254 -0.149955 -0.175172 0.105314 0.092605 0.094113 0.099215 0.099167 0.107183 0.101649 0.075174 0.120393 0.088713 0.093530 0.095923 0.100007 0.081041 0.100566 0.110918 0.117663 0.151481 0.138845 0.156379 0.144410 0.143490 0.155286 0.156119 0.158026 0.156493
qa: -0.2843 -0.4630 -0.3259 0.1921 -0.0131 -0.1212 -0.2932 -0.3115 -0.2988 0.3700 -0.0129 -0.2279 -0.2409 0.0787 0.0195 -0.2024 -0.2234 0.2799 -0.1100 -0.2560 0.2826 -0.2268 -0.1949 -0.1353 -0.1500 -0.1752 0.1053 0.0926 0.0941 0.0992 0.0992 0.1072 0.1016 0.0752 0.1204 0.0887 0.0935 0.0959 0.1000 0.0810 0.1006 0.1109 0.1177 0.1515 0.1388 0.1564 0.1444 0.1435 0.1553 0.1561 0.1580 0.1565
va: 2.1126 2.0352 2.0873 3.6900 3.8251 3.8289 3.9037 3.8855 3.8944 4.2009 3.7067 3.9316 3.9348 3.8435 3.6997 3.9429 3.9560 3.7534 3.8980 4.0028 3.6885 3.9647 3.8926 3.8724 3.8471 3.8581 1.0243 1.0322 1.0023 0.9998 1.0019 1.0030 1.0128 1.0033 1.0037 1.0064 0.9964 0.9965 0.9982 1.0146 1.0003 1.0138 0.9957 0.9692 1.0038 0.9894 1.0085 1.0090 0.9969 0.9905 0.9913 0.9915
dispcorr: -0.027312257 hartree
energy: -1117.895877305470
dipole: -28.55213 28.04229 -0.50984 -5.92664 5.35184 -0.57480 2.17343 -1.63125 0.54218
magnitude: 0.94036 au
magnitude: 2.39021 debye
