program: Orca
programVersion: 5.0.2
elementType: O O O C C C C C C C C C C C C C C C C C C C C C C C H H H H H H H H H H H H H H H H H H H H H H H H H H
charge: 0
multiplicity: 1
keywords: wb97x-d3
keywords: def2-TZVPP
keywords: def2/J RIJCOSX
keywords: DEFGRID2
keywords: scfconv7
keywords: smallprint printgap noloewdin
keywords: NOSOSCF
formula: C23H26O3
InChI: InChI=1/C23H26O3/c1-16(2)13-20-21(23(20,3)4)22(24)25-15-17-9-8-12-19(14-17)26-18-10-6-5-7-11-18/h5-14,20-21H,15H2,1-4H3
52 atoms
O  0.74203 -2.209544 -1.153725
O  0.034563 -2.643033 0.925025
O  2.761158 2.008713 0.749329
C  -2.796346 -2.156743 -0.41722
C  -2.365468 -0.943229 0.347581
C  -1.416389 -1.564152 -0.651362
C  -3.774911 -1.984726 -1.552223
C  -2.961353 -3.460178 0.32253
C  -2.902713 0.413537 0.074032
C  -0.17352 -2.199455 -0.17825
C  -3.876386 1.006858 0.769471
C  -4.330258 2.396096 0.441133
C  -4.588339 0.358365 1.916209
C  2.063313 -2.626185 -0.847662
C  2.899682 -1.517334 -0.262495
C  2.390411 -0.242791 -0.050132
C  4.22917 -1.789562 0.0474
C  3.210866 0.750827 0.473575
C  5.03657 -0.789751 0.565768
C  4.537844 0.486182 0.780929
C  1.631586 2.490227 0.138504
C  1.557057 2.603885 -1.244115
C  0.586969 2.916372 0.944292
C  0.417944 3.148203 -1.818026
C  -0.543511 3.469732 0.357896
C  -0.634454 3.583324 -1.022084
H  -2.11215 -1.144855 1.384698
H  -1.309388 -1.034519 -1.592172
H  -4.798329 -1.954533 -1.171893
H  -3.707558 -2.82015 -2.251972
H  -3.607186 -1.06715 -2.115525
H  -2.749741 -4.31179 -0.327579
H  -3.994564 -3.558302 0.662381
H  -2.322711 -3.540473 1.199563
H  -2.455806 0.957783 -0.75338
H  -5.397222 2.415076 0.203148
H  -3.790123 2.816133 -0.40755
H  -4.194547 3.066537 1.294112
H  -4.452035 0.932129 2.836843
H  -4.260573 -0.662641 2.10631
H  -5.665259 0.330356 1.729907
H  2.490116 -2.944276 -1.799501
H  2.062703 -3.495975 -0.187286
H  1.36163 -0.010425 -0.290342
H  4.633305 -2.780691 -0.121096
H  6.071217 -1.002067 0.8025
H  5.168274 1.267997 1.185337
H  2.379631 2.27383 -1.866836
H  0.661514 2.823249 2.020525
H  0.357644 3.238462 -2.894939
H  -1.357491 3.807302 0.986599
H  -1.517967 4.012468 -1.47635
elementType: O C H
totalener: -1117.86901185 hartree
nucrepener: 2321.17557238 hartree
electener: -3439.04458423 hartree
oneelecener: -6132.02934481 hartree
twoeener: 2692.98476058 hartree
cpcmener: -0.02585333 hartree
kineticenergy: 1112.80106615 hartree
xcener: -110.228859014756 hartree
chargesum: -0.0000000
charge: -0.292466 -0.460542 -0.326317 0.145242 0.005357 -0.119343 -0.265546 -0.295641 -0.284236 0.378690 -0.016206 -0.252509 -0.254894 0.084320 0.016315 -0.196974 -0.262463 0.295987 -0.103748 -0.262808 0.266403 -0.187301 -0.216548 -0.128462 -0.133389 -0.201216 0.101104 0.089417 0.096590 0.099015 0.090781 0.100596 0.095115 0.093563 0.126695 0.104254 0.087311 0.096837 0.099607 0.087592 0.096067 0.129626 0.116538 0.134352 0.141803 0.155321 0.144327 0.154852 0.145323 0.159060 0.163475 0.159078
qa: -0.2925 -0.4605 -0.3263 0.1452 0.0054 -0.1193 -0.2655 -0.2956 -0.2842 0.3787 -0.0162 -0.2525 -0.2549 0.0843 0.0163 -0.1970 -0.2625 0.2960 -0.1037 -0.2628 0.2664 -0.1873 -0.2165 -0.1285 -0.1334 -0.2012 0.1011 0.0894 0.0966 0.0990 0.0908 0.1006 0.0951 0.0936 0.1267 0.1043 0.0873 0.0968 0.0996 0.0876 0.0961 0.1296 0.1165 0.1344 0.1418 0.1553 0.1443 0.1549 0.1453 0.1591 0.1635 0.1591
va: 2.1164 2.0428 2.0832 3.7218 3.7788 3.8574 3.8995 3.8964 3.8655 4.1878 3.6437 3.9368 3.9465 3.8182 3.6772 3.8911 3.9961 3.7271 3.8918 3.9993 3.7035 3.9349 3.9934 3.8748 3.8220 3.8574 1.0241 1.0391 1.0023 1.0034 1.0027 1.0001 1.0007 1.0186 0.9975 1.0004 1.0060 0.9935 0.9985 1.0077 0.9973 0.9903 1.0135 1.0173 1.0003 0.9890 1.0090 0.9969 1.0065 0.9893 0.9840 0.9925
dispcorr: -0.027226126 hartree
energy: -1117.896237975914
dipole: -30.59712 29.76044 -0.83668 -2.58347 2.75025 0.16678 -0.58222 -0.56996 -1.15218
magnitude: 1.43365 au
magnitude: 3.64406 debye
