program: Orca
programVersion: 5.0.2
elementType: O O O C C C C C C C C C C C C C C C C C C C C C C C H H H H H H H H H H H H H H H H H H H H H H H H H H
charge: 0
multiplicity: 1
keywords: wb97x-d3
keywords: def2-TZVPP
keywords: def2/J RIJCOSX
keywords: DEFGRID2
keywords: scfconv7
keywords: smallprint printgap noloewdin
keywords: NOSOSCF
formula: C23H26O3
InChI: InChI=1/C23H26O3/c1-16(2)13-20-21(23(20,3)4)22(24)25-15-17-9-8-12-19(14-17)26-18-10-6-5-7-11-18/h5-14,20-21H,15H2,1-4H3
52 atoms
O  0.460215 -2.870991 0.182622
O  -0.211973 -1.277473 1.599674
O  2.792274 2.205569 0.078547
C  -3.102573 -2.012414 0.682866
C  -2.571062 -0.935602 -0.195172
C  -1.751547 -2.206774 0.022003
C  -4.197142 -2.909999 0.156703
C  -3.21054 -1.762682 2.167138
C  -3.118111 -0.617403 -1.537091
C  -0.459571 -2.057512 0.709705
C  -2.426977 -0.016504 -2.510137
C  -3.061463 0.32704 -3.82273
C  -0.983827 0.368406 -2.381857
C  1.839238 -2.599283 0.479831
C  2.282367 -1.402584 -0.313047
C  2.393215 -0.158052 0.292637
C  2.49179 -1.522125 -1.685602
C  2.670613 0.962613 -0.480163
C  2.801128 -0.402836 -2.44128
C  2.875151 0.849784 -1.846443
C  1.858837 2.648493 0.975059
C  0.523627 2.264029 0.926012
C  2.295724 3.559712 1.928361
C  -0.368046 2.790123 1.850216
C  1.3897 4.085272 2.837511
C  0.056098 3.700169 2.808215
H  -2.16743 -0.082877 0.345456
H  -1.738284 -2.904757 -0.807077
H  -5.175899 -2.445579 0.292569
H  -4.20603 -3.857785 0.698444
H  -4.082635 -3.140401 -0.902511
H  -4.210646 -1.394428 2.402464
H  -2.498857 -1.026372 2.530696
H  -3.061125 -2.684529 2.732953
H  -4.161338 -0.86208 -1.717089
H  -2.994687 1.400215 -4.02097
H  -4.113253 0.043364 -3.860398
H  -2.547198 -0.170777 -4.649108
H  -0.414434 0.016251 -3.246698
H  -0.507054 -0.029111 -1.486121
H  -0.871572 1.457064 -2.364937
H  2.371629 -3.49785 0.171737
H  1.994826 -2.462653 1.55057
H  2.245839 -0.061033 1.361106
H  2.412847 -2.492209 -2.161809
H  2.970261 -0.498771 -3.506069
H  3.095463 1.731877 -2.434668
H  0.171669 1.566509 0.176626
H  3.337537 3.854741 1.95302
H  -1.406299 2.485684 1.812052
H  1.733857 4.795304 3.578577
H  -0.646545 4.106077 3.524224
elementType: O C H
totalener: -1117.86671698 hartree
nucrepener: 2358.11147684 hartree
electener: -3475.97819381 hartree
oneelecener: -6206.01958532 hartree
twoeener: 2730.04139151 hartree
cpcmener: -0.02374787 hartree
kineticenergy: 1112.80908583 hartree
xcener: -110.227935156922 hartree
chargesum: 0.0000000
charge: -0.287501 -0.470059 -0.331791 0.173914 -0.039513 -0.061024 -0.294958 -0.279598 -0.285361 0.357436 0.006270 -0.230414 -0.212896 0.083611 0.000092 -0.168956 -0.213674 0.271854 -0.141752 -0.234165 0.261838 -0.142127 -0.225819 -0.194922 -0.139331 -0.161490 0.096866 0.089425 0.099682 0.097801 0.091595 0.092687 0.091851 0.098140 0.122673 0.094980 0.088937 0.095398 0.099807 0.014945 0.107024 0.124343 0.112828 0.140059 0.140702 0.156909 0.144651 0.144296 0.144146 0.157639 0.155914 0.157037
qa: -0.2875 -0.4701 -0.3318 0.1739 -0.0395 -0.0610 -0.2950 -0.2796 -0.2854 0.3574 0.0063 -0.2304 -0.2129 0.0836 0.0001 -0.1690 -0.2137 0.2719 -0.1418 -0.2342 0.2618 -0.1421 -0.2258 -0.1949 -0.1393 -0.1615 0.0969 0.0894 0.0997 0.0978 0.0916 0.0927 0.0919 0.0981 0.1227 0.0950 0.0889 0.0954 0.0998 0.0149 0.1070 0.1243 0.1128 0.1401 0.1407 0.1569 0.1447 0.1443 0.1441 0.1576 0.1559 0.1570
va: 2.1105 2.0219 2.0836 3.7005 3.8350 3.7863 3.9138 3.8811 3.8714 4.1771 3.7384 3.9296 3.9316 3.8165 3.6038 3.8985 3.9297 3.7123 3.8643 3.9804 3.7298 3.8388 3.9718 3.9358 3.9086 3.8848 1.0232 1.0336 0.9990 1.0030 1.0010 1.0011 1.0204 0.9994 1.0044 0.9954 1.0068 0.9967 1.0031 1.0221 0.9974 0.9941 1.0118 1.0199 1.0048 0.9901 1.0066 0.9762 1.0088 0.9921 0.9894 0.9907
dispcorr: -0.029109946 hartree
energy: -1117.895826924256
dipole: -23.09849 22.59022 -0.50827 -5.67459 5.02225 -0.65234 -7.86146 6.93171 -0.92975
magnitude: 1.24431 au
magnitude: 3.16279 debye
