program: Orca
programVersion: 5.0.2
elementType: O O O C C C C C C C C C C C C C C C C C C C C C C C H H H H H H H H H H H H H H H H H H H H H H H H H H
charge: 0
multiplicity: 1
keywords: wb97x-d3
keywords: def2-TZVPP
keywords: def2/J RIJCOSX
keywords: DEFGRID2
keywords: scfconv7
keywords: smallprint printgap noloewdin
keywords: NOSOSCF
formula: C23H26O3
InChI: InChI=1/C23H26O3/c1-16(2)13-20-21(23(20,3)4)22(24)25-15-17-9-8-12-19(14-17)26-18-10-6-5-7-11-18/h5-14,20-21H,15H2,1-4H3
52 atoms
O  -0.123062 -1.619687 0.290633
O  -1.163884 -3.181597 1.495768
O  2.385305 2.482798 -0.742375
C  -3.240525 -2.896503 -0.883863
C  -3.762949 -2.260082 0.368254
C  -2.382132 -1.898161 -0.121603
C  -3.771477 -2.421499 -2.21373
C  -2.907196 -4.367145 -0.866227
C  -4.830783 -1.229798 0.354205
C  -1.196368 -2.321341 0.647634
C  -6.111851 -1.448364 0.66296
C  -7.113704 -0.33438 0.658587
C  -6.658412 -2.791301 1.039206
C  1.102375 -1.876522 0.97381
C  2.140737 -0.932672 0.442832
C  1.813104 0.375737 0.104486
C  3.460651 -1.355784 0.336259
C  2.795675 1.238015 -0.356904
C  4.437216 -0.478925 -0.113931
C  4.115822 0.82017 -0.473002
C  3.167007 3.576086 -0.489424
C  3.232631 4.548119 -1.477623
C  3.824606 3.752236 0.721995
C  3.96229 5.705768 -1.249752
C  4.559212 4.909972 0.931354
C  4.63387 5.889842 -0.049551
H  -3.767275 -2.922732 1.228979
H  -2.2775 -0.932135 -0.604766
H  -3.949804 -1.346948 -2.236241
H  -4.717116 -2.916657 -2.444652
H  -3.070692 -2.657765 -3.016694
H  -3.779681 -4.942831 -1.181812
H  -2.618514 -4.730653 0.117514
H  -2.097058 -4.595392 -1.561868
H  -4.533911 -0.221657 0.078704
H  -7.928142 -0.538406 -0.041553
H  -6.666008 0.621166 0.385491
H  -7.5760 -0.218941 1.642605
H  -7.045223 -2.783651 2.061732
H  -5.925419 -3.592793 0.965377
H  -7.501072 -3.055362 0.395285
H  1.415466 -2.911623 0.820942
H  0.967459 -1.727052 2.048921
H  0.79578 0.737582 0.188099
H  3.726577 -2.372941 0.596586
H  5.461608 -0.815875 -0.2042
H  4.882414 1.487672 -0.845152
H  2.711669 4.398654 -2.415067
H  3.764452 3.001193 1.499797
H  4.010306 6.462939 -2.021677
H  5.071981 5.046312 1.874647
H  5.207992 6.790504 0.122376
elementType: O C H
totalener: -1117.87022285 hartree
nucrepener: 2118.50500527 hartree
electener: -3236.37522812 hartree
oneelecener: -5726.35550738 hartree
twoeener: 2489.98027926 hartree
cpcmener: -0.02463697 hartree
kineticenergy: 1112.81931867 hartree
xcener: -110.228712639322 hartree
chargesum: -0.0000000
charge: -0.279051 -0.473110 -0.329378 0.144842 -0.012206 -0.105743 -0.264923 -0.292918 -0.258237 0.393071 -0.033808 -0.228878 -0.250763 0.096195 0.032443 -0.247856 -0.217839 0.242253 -0.140104 -0.188771 0.273690 -0.242036 -0.183467 -0.126604 -0.149244 -0.182268 0.096235 0.092443 0.090487 0.095601 0.098554 0.095061 0.093496 0.100526 0.119338 0.093452 0.088901 0.094094 0.098891 0.087496 0.094712 0.109255 0.113931 0.129787 0.141546 0.158389 0.155800 0.145816 0.156329 0.157592 0.159228 0.157752
qa: -0.2791 -0.4731 -0.3294 0.1448 -0.0122 -0.1057 -0.2649 -0.2929 -0.2582 0.3931 -0.0338 -0.2289 -0.2508 0.0962 0.0324 -0.2479 -0.2178 0.2423 -0.1401 -0.1888 0.2737 -0.2420 -0.1835 -0.1266 -0.1492 -0.1823 0.0962 0.0924 0.0905 0.0956 0.0986 0.0951 0.0935 0.1005 0.1193 0.0935 0.0889 0.0941 0.0989 0.0875 0.0947 0.1093 0.1139 0.1298 0.1415 0.1584 0.1558 0.1458 0.1563 0.1576 0.1592 0.1578
va: 2.1347 2.0366 2.0707 3.6799 3.7770 3.8949 3.9060 3.9012 3.8687 4.1715 3.7030 3.9285 3.9428 3.8073 3.7413 4.0529 3.9657 3.7798 3.9088 3.9155 3.6986 4.0030 3.9022 3.8901 3.8954 3.9020 1.0272 1.0310 1.0026 1.0030 1.0032 1.0009 1.0182 0.9996 1.0076 0.9965 1.0081 0.9952 0.9981 1.0079 0.9979 1.0024 0.9944 1.0329 1.0044 0.9912 0.9962 1.0081 0.9972 0.9893 0.9905 0.9906
dispcorr: -0.022264647 hartree
energy: -1117.892487500547
dipole: -33.02857 33.26763 0.23906 -13.75870 14.23223 0.47354 -2.47670 2.04099 -0.43571
magnitude: 0.68646 au
magnitude: 1.74484 debye
