program: Orca
programVersion: 5.0.2
elementType: O O O C C C C C C C C C C C C C C C C C C C C C C C H H H H H H H H H H H H H H H H H H H H H H H H H H
charge: 0
multiplicity: 1
keywords: wb97x-d3
keywords: def2-TZVPP
keywords: def2/J RIJCOSX
keywords: DEFGRID2
keywords: scfconv7
keywords: smallprint printgap noloewdin
keywords: NOSOSCF
formula: C23H26O3
InChI: InChI=1/C23H26O3/c1-16(2)13-20-21(23(20,3)4)22(24)25-15-17-9-8-12-19(14-17)26-18-10-6-5-7-11-18/h5-14,20-21H,15H2,1-4H3
52 atoms
O  0.438721 -2.712823 0.005546
O  -0.229623 -1.274801 1.583928
O  2.919607 2.179864 0.172195
C  -3.099825 -2.047421 0.642163
C  -2.675757 -0.795088 -0.043286
C  -1.76758 -2.013434 -0.08995
C  -4.159025 -2.904638 -0.008025
C  -3.152397 -2.087128 2.149628
C  -3.342987 -0.296264 -1.273699
C  -0.471401 -1.94497 0.60685
C  -2.731387 0.234222 -2.336088
C  -3.514489 0.744592 -3.507613
C  -1.245943 0.377259 -2.46105
C  1.811284 -2.600158 0.418838
C  2.44486 -1.428632 -0.275824
C  2.451737 -0.176039 0.326686
C  2.951866 -1.573555 -1.564563
C  2.912077 0.92826 -0.378027
C  3.452164 -0.47175 -2.24162
C  3.418273 0.788271 -1.662027
C  1.860035 2.585314 0.939618
C  0.544738 2.284247 0.603941
C  2.144576 3.361504 2.054245
C  -0.484662 2.75972 1.402594
C  1.103328 3.838447 2.838483
C  -0.213439 3.535111 2.522211
H  -2.315563 -0.018932 0.62913
H  -1.744166 -2.554816 -1.028918
H  -5.157173 -2.546232 0.252071
H  -4.081366 -3.937561 0.336955
H  -4.083186 -2.91412 -1.095465
H  -4.164782 -1.855887 2.48488
H  -2.484417 -1.371871 2.621149
H  -2.904242 -3.080745 2.527132
H  -4.429333 -0.339429 -1.277504
H  -3.229603 0.224094 -4.425923
H  -3.314785 1.805404 -3.680669
H  -4.589072 0.622968 -3.371515
H  -0.883453 -0.121887 -3.363806
H  -0.697906 -0.027978 -1.612891
H  -0.969745 1.430293 -2.563445
H  2.274292 -3.535449 0.10792
H  1.890371 -2.526647 1.503794
H  2.081756 -0.061042 1.336944
H  2.957518 -2.548355 -2.036992
H  3.854817 -0.587293 -3.2396
H  3.785266 1.654965 -2.197449
H  0.316226 1.689292 -0.271315
H  3.173399 3.589846 2.303914
H  -1.507812 2.522131 1.140068
H  1.328152 4.444804 3.706488
H  -1.022311 3.901512 3.140484
elementType: O C H
totalener: -1117.86712744 hartree
nucrepener: 2347.71368146 hartree
electener: -3465.58080890 hartree
oneelecener: -6185.24644720 hartree
twoeener: 2719.66563830 hartree
cpcmener: -0.02357919 hartree
kineticenergy: 1112.80976261 hartree
xcener: -110.227393552917 hartree
chargesum: -0.0000000
charge: -0.284391 -0.471775 -0.331801 0.146944 -0.022465 -0.066968 -0.286999 -0.284759 -0.287591 0.359097 -0.013525 -0.230256 -0.219942 0.079129 -0.013686 -0.164829 -0.226542 0.263546 -0.113882 -0.248520 0.273773 -0.175504 -0.225530 -0.176510 -0.135131 -0.169471 0.094678 0.097298 0.098105 0.097533 0.092716 0.092877 0.093420 0.099101 0.120910 0.094914 0.095703 0.089090 0.104749 0.053166 0.103047 0.121907 0.115499 0.143955 0.142364 0.157779 0.145910 0.156224 0.144051 0.158088 0.156912 0.157593
qa: -0.2844 -0.4718 -0.3318 0.1469 -0.0225 -0.0670 -0.2870 -0.2848 -0.2876 0.3591 -0.0135 -0.2303 -0.2199 0.0791 -0.0137 -0.1648 -0.2265 0.2635 -0.1139 -0.2485 0.2738 -0.1755 -0.2255 -0.1765 -0.1351 -0.1695 0.0947 0.0973 0.0981 0.0975 0.0927 0.0929 0.0934 0.0991 0.1209 0.0949 0.0957 0.0891 0.1047 0.0532 0.1030 0.1219 0.1155 0.1440 0.1424 0.1578 0.1459 0.1562 0.1441 0.1581 0.1569 0.1576
va: 2.1151 2.0182 2.0824 3.7126 3.8174 3.7829 3.9103 3.8891 3.8539 4.1671 3.7381 3.9312 3.9364 3.8123 3.6425 3.8642 3.9741 3.7405 3.8844 4.0154 3.7228 3.8466 3.9859 3.9218 3.8993 3.9032 1.0196 1.0289 1.0003 1.0029 1.0025 1.0009 1.0202 0.9987 1.0054 0.9970 0.9963 1.0064 1.0014 1.0078 0.9977 0.9948 1.0139 1.0235 1.0029 0.9883 1.0064 0.9932 1.0084 0.9896 0.9892 0.9903
dispcorr: -0.028204491 hartree
energy: -1117.895331930205
dipole: -24.45995 23.93053 -0.52942 -5.93591 5.29475 -0.64116 -7.82773 6.89009 -0.93764
magnitude: 1.25321 au
magnitude: 3.18541 debye
